{"text_format":"1","workbook":"xlsx","n_sheets":6,"sheets":["Accueil","Planning_général","Conditionnement","Energie","Abattoir","Magasin"],"not_rendered":{"charts":0,"images":1,"macros":1,"external_links":0,"defined_names":70,"comments":5,"pivot_tables":0},"unopened":[],"bounds":{"document_bytes":16777216,"sheet_cells":100000,"rows_first":2000,"rows_last":500,"rows_between":2000,"halvings":0,"cell_chars":16384,"cell_head_chars":4096},"cells_cut":0,"cells_raw":0,"read":"whole","date_system":"1900"}

{"sheet":"Accueil","index":0,"n_rows":0,"n_cols":0,"rows_kept":0,"cut":false,"hidden":false,"merged":[]}

{"sheet":"Planning_général","index":1,"n_rows":62,"n_cols":387,"rows_kept":62,"cut":false,"hidden":false,"merged":[[6,311,6,340],[6,341,6,371],[6,372,6,376],[6,6,6,36],[6,37,6,64],[6,65,6,96],[6,97,6,126],[6,127,6,157],[6,158,6,187],[6,188,6,218],[6,219,6,249],[6,250,6,279],[6,280,6,310],[7,342,7,348],[7,349,7,355],[7,356,7,362],[7,363,7,369],[7,370,7,376],[7,307,7,313],[7,314,7,320],[7,321,7,327],[7,328,7,334],[7,335,7,341],[7,272,7,278],[7,279,7,285],[7,286,7,292],[7,293,7,299],[7,300,7,306],[7,237,7,243],[7,244,7,250],[7,251,7,257],[7,258,7,264],[7,265,7,271],[7,202,7,208],[7,209,7,215],[7,216,7,222],[7,223,7,229],[7,230,7,236],[7,167,7,173],[7,174,7,180],[7,181,7,187],[7,188,7,194],[7,195,7,201],[7,132,7,138],[7,139,7,145],[7,146,7,152],[7,153,7,159],[7,160,7,166],[7,97,7,103],[7,104,7,110],[7,111,7,117],[7,118,7,124],[7,125,7,131],[7,62,7,68],[7,69,7,75],[7,76,7,82],[7,83,7,89],[7,90,7,96],[7,27,7,33],[7,34,7,40],[7,41,7,47],[7,48,7,54],[7,55,7,61],[46,3,53,3],[54,3,61,3],[7,6,7,12],[7,13,7,19],[7,20,7,26],[16,3,30,3],[31,3,45,3],[10,3,15,3]]}
[]
[null,"Année",2019]
[]
[null,null,null,null,1,2,3,4,5,6,7,8,9,10,11,12,13,14,15,16,17,18,19,20,21,22,23,24,25,26,27,28,29,30,31,32,33,34,35,36,37,38,39,40,41,42,43,44,45,46,47,48,49,50,51,52,53,54,55,56,57,58,59,60,61,62,63,64,65,66,67,68,69,70,71,72,73,74,75,76,77,78,79,80,81,82,83,84,85,86,87,88,89,90,91,92,93,94,95,96,97,98,99,100,101,102,103,104,105,106,107,108,109,110,111,112,113,114,115,116,117,118,119,120,121,122,123,124,125,126,127,128,129,130,131,132,133,134,135,136,137,138,139,140,141,142,143,144,145,146,147,148,149,150,151,152,153,154,155,156,157,158,159,160,161,162,163,164,165,166,167,168,169,170,171,172,173,174,175,176,177,178,179,180,181,182,183,184,185,186,187,188,189,190,191,192,193,194,195,196,197,198,199,200,201,202,203,204,205,206,207,208,209,210,211,212,213,214,215,216,217,218,219,220,221,222,223,224,225,226,227,228,229,230,231,232,233,234,235,236,237,238,239,240,241,242,243,244,245,246,247,248,249,250,251,252,253,254,255,256,257,258,259,260,261,262,263,264,265,266,267,268,269,270,271,272,273,274,275,276,277,278,279,280,281,282,283,284,285,286,287,288,289,290,291,292,293,294,295,296,297,298,299,300,301,302,303,304,305,306,307,308,309,310,311,312,313,314,315,316,317,318,319,320,321,322,323,324,325,326,327,328,329,330,331,332,333,334,335,336,337,338,339,340,341,342,343,344,345,346,347,348,349,350,351,352,353,354,355,356,357,358,359,360,361,362,363,364,365,366,367,368,369,370,371,372,373]
[null,null,null,null,null,null,{"$f":"DATE(C2,1,1)","v":"2019-01-01"},{"$f":"G5+1","v":"2019-01-02"},{"$f":"H5+1","v":"2019-01-03"},"2019-01-04","2019-01-05","2019-01-06","2019-01-07","2019-01-08","2019-01-09","2019-01-10","2019-01-11","2019-01-12","2019-01-13","2019-01-14","2019-01-15","2019-01-16","2019-01-17","2019-01-18","2019-01-19","2019-01-20","2019-01-21","2019-01-22","2019-01-23","2019-01-24","2019-01-25","2019-01-26","2019-01-27","2019-01-28","2019-01-29","2019-01-30","2019-01-31","2019-02-01","2019-02-02","2019-02-03","2019-02-04","2019-02-05","2019-02-06","2019-02-07","2019-02-08","2019-02-09","2019-02-10","2019-02-11",{"$f":"AV5+1","v":"2019-02-12"},"2019-02-13","2019-02-14","2019-02-15","2019-02-16","2019-02-17","2019-02-18","2019-02-19","2019-02-20","2019-02-21","2019-02-22","2019-02-23","2019-02-24","2019-02-25","2019-02-26","2019-02-27","2019-02-28",{"$f":"BM5+1","v":"2019-03-01"},{"$f":"BN5+1","v":"2019-03-02"},{"$f":"BO5+1","v":"2019-03-03"},{"$f":"BP5+1","v":"2019-03-04"},{"$f":"BQ5+1","v":"2019-03-05"},{"$f":"BR5+1","v":"2019-03-06"},{"$f":"BS5+1","v":"2019-03-07"},{"$f":"BT5+1","v":"2019-03-08"},{"$f":"BU5+1","v":"2019-03-09"},{"$f":"BV5+1","v":"2019-03-10"},{"$f":"BW5+1","v":"2019-03-11"},{"$f":"BX5+1","v":"2019-03-12"},"2019-03-13","2019-03-14","2019-03-15","2019-03-16","2019-03-17","2019-03-18","2019-03-19","2019-03-20","2019-03-21","2019-03-22","2019-03-23","2019-03-24","2019-03-25","2019-03-26","2019-03-27","2019-03-28","2019-03-29","2019-03-30","2019-03-31","2019-04-01","2019-04-02","2019-04-03","2019-04-04","2019-04-05","2019-04-06","2019-04-07","2019-04-08","2019-04-09","2019-04-10","2019-04-11","2019-04-12","2019-04-13","2019-04-14","2019-04-15","2019-04-16",{"$f":"DH5+1","v":"2019-04-17"},"2019-04-18","2019-04-19","2019-04-20","2019-04-21","2019-04-22","2019-04-23","2019-04-24","2019-04-25","2019-04-26","2019-04-27","2019-04-28","2019-04-29","2019-04-30","2019-05-01","2019-05-02","2019-05-03","2019-05-04","2019-05-05","2019-05-06","2019-05-07","2019-05-08","2019-05-09","2019-05-10","2019-05-11","2019-05-12","2019-05-13","2019-05-14","2019-05-15","2019-05-16","2019-05-17","2019-05-18","2019-05-19","2019-05-20","2019-05-21","2019-05-22","2019-05-23","2019-05-24","2019-05-25","2019-05-26","2019-05-27",{"$f":"EW5+1","v":"2019-05-28"},"2019-05-29","2019-05-30","2019-05-31","2019-06-01","2019-06-02","2019-06-03","2019-06-04","2019-06-05","2019-06-06","2019-06-07","2019-06-08","2019-06-09","2019-06-10","2019-06-11","2019-06-12","2019-06-13","2019-06-14","2019-06-15","2019-06-16","2019-06-17",{"$f":"FR5+1","v":"2019-06-18"},"2019-06-19","2019-06-20","2019-06-21","2019-06-22","2019-06-23","2019-06-24","2019-06-25","2019-06-26","2019-06-27","2019-06-28","2019-06-29","2019-06-30","2019-07-01","2019-07-02","2019-07-03","2019-07-04","2019-07-05","2019-07-06","2019-07-07","2019-07-08","2019-07-09","2019-07-10","2019-07-11","2019-07-12","2019-07-13","2019-07-14","2019-07-15","2019-07-16","2019-07-17","2019-07-18","2019-07-19","2019-07-20","2019-07-21","2019-07-22","2019-07-23","2019-07-24","2019-07-25","2019-07-26","2019-07-27","2019-07-28","2019-07-29","2019-07-30","2019-07-31","2019-08-01","2019-08-02","2019-08-03","2019-08-04","2019-08-05","2019-08-06","2019-08-07","2019-08-08","2019-08-09","2019-08-10","2019-08-11","2019-08-12","2019-08-13","2019-08-14","2019-08-15","2019-08-16","2019-08-17","2019-08-18","2019-08-19","2019-08-20",{"$f":"ID5+1","v":"2019-08-21"},"2019-08-22","2019-08-23","2019-08-24","2019-08-25","2019-08-26","2019-08-27","2019-08-28","2019-08-29","2019-08-30","2019-08-31","2019-09-01","2019-09-02","2019-09-03","2019-09-04","2019-09-05","2019-09-06","2019-09-07","2019-09-08","2019-09-09","2019-09-10","2019-09-11","2019-09-12","2019-09-13","2019-09-14","2019-09-15","2019-09-16","2019-09-17","2019-09-18","2019-09-19","2019-09-20","2019-09-21","2019-09-22","2019-09-23","2019-09-24","2019-09-25","2019-09-26","2019-09-27","2019-09-28","2019-09-29","2019-09-30","2019-10-01","2019-10-02","2019-10-03","2019-10-04","2019-10-05","2019-10-06","2019-10-07","2019-10-08","2019-10-09","2019-10-10","2019-10-11","2019-10-12","2019-10-13","2019-10-14","2019-10-15","2019-10-16","2019-10-17","2019-10-18","2019-10-19","2019-10-20","2019-10-21","2019-10-22","2019-10-23",{"$f":"KP5+1","v":"2019-10-24"},"2019-10-25","2019-10-26","2019-10-27","2019-10-28","2019-10-29","2019-10-30","2019-10-31","2019-11-01","2019-11-02","2019-11-03","2019-11-04","2019-11-05","2019-11-06","2019-11-07","2019-11-08","2019-11-09","2019-11-10","2019-11-11","2019-11-12","2019-11-13","2019-11-14","2019-11-15","2019-11-16","2019-11-17","2019-11-18","2019-11-19","2019-11-20","2019-11-21","2019-11-22","2019-11-23","2019-11-24","2019-11-25","2019-11-26","2019-11-27","2019-11-28","2019-11-29","2019-11-30","2019-12-01","2019-12-02",{"$f":"MD5+1","v":"2019-12-03"},"2019-12-04","2019-12-05","2019-12-06","2019-12-07","2019-12-08","2019-12-09","2019-12-10","2019-12-11","2019-12-12","2019-12-13","2019-12-14","2019-12-15","2019-12-16",{"$f":"MR5+1","v":"2019-12-17"},"2019-12-18","2019-12-19","2019-12-20","2019-12-21","2019-12-22","2019-12-23",{"$f":"MY5+1","v":"2019-12-24"},"2019-12-25","2019-12-26","2019-12-27","2019-12-28","2019-12-29","2019-12-30","2019-12-31","2020-01-01","2020-01-02","2020-01-03","2020-01-04","2020-01-05","2020-01-06"]
[null,null,null,null,null,null,{"$f":"WEEKDAY(G5)","v":3},{"$f":"WEEKDAY(H5)","v":4},5,6,7,1,2,3,4,5,6,7,1,2,3,4,5,6,7,1,2,3,4,5,6,7,1,2,3,4,5,6,{"$f":"WEEKDAY(AM5)","v":7},1,2,3,4,5,6,7,1,2,3,4,5,6,7,1,2,3,4,5,6,7,1,2,3,4,5,{"$f":"WEEKDAY(BN5)","v":6},7,1,2,3,4,5,6,7,1,2,3,4,5,6,7,1,2,3,4,5,6,7,1,2,3,4,5,6,7,1,2,3,4,5,6,7,1,2,3,4,5,6,7,1,2,3,4,5,6,7,1,2,3,4,5,6,7,1,2,3,4,5,6,{"$f":"WEEKDAY(DZ5)","v":7},1,2,3,4,5,6,7,1,2,3,4,5,6,7,1,2,3,4,5,6,7,1,2,3,4,5,6,7,1,2,3,4,5,6,7,1,2,3,4,5,6,7,1,2,3,4,5,6,7,1,2,3,4,5,6,7,1,2,3,4,5,6,7,{"$f":"WEEKDAY(GL5)","v":1},2,3,4,5,6,7,1,2,3,4,5,6,7,1,2,3,4,5,6,7,1,2,3,4,5,6,7,1,2,3,4,5,6,7,1,2,3,4,5,6,7,1,2,3,4,5,6,7,1,2,3,4,5,6,7,1,2,3,4,5,6,7,1,{"$f":"WEEKDAY(IX5)","v":2},3,4,5,6,7,1,2,3,4,5,6,7,1,2,3,4,5,6,7,1,2,3,4,5,6,7,1,2,3,4,5,6,7,1,2,3,4,5,6,7,1,2,3,4,5,6,7,1,2,3,4,5,6,7,1,2,3,4,5,6,7,1,2,{"$f":"WEEKDAY(LJ5)","v":3},4,5,6,7,1,2,3,4,5,6,7,1,2,3,4,5,6,7,1,2,3,4,5,6,7,1,2,3,4,5,6,7,1,2,3,4,5,6,7,1,2,3,4,5,6,7,1,2,3,4,5,6,7,1,2]
{"$rows_left_out":57}
{"sheet":"Conditionnement","index":2,"n_rows":93,"n_cols":53,"rows_kept":93,"cut":false,"hidden":false,"merged":[[19,1,21,2],[19,3,21,4],[21,6,21,8],[87,13,87,15],[88,13,88,15],[89,13,89,15],[90,13,90,15],[30,4,30,9],[31,4,31,9],[32,4,32,9],[33,4,33,9],[34,4,34,9],[35,4,35,9],[33,14,33,15],[34,14,34,15],[23,1,28,2],[30,1,35,2],[24,6,24,8],[25,6,25,8],[26,6,26,8],[25,3,26,4],[23,3,24,4],[55,14,55,15],[56,14,56,15],[20,5,21,5],[78,16,80,16],[86,13,86,15],[8,6,8,8],[15,6,15,8],[14,6,14,8],[13,6,13,8],[16,3,18,4],[32,14,32,15],[74,14,74,15],[64,14,64,15],[27,3,28,4],[23,6,23,8],[27,6,27,8],[28,6,28,8],[20,6,20,8],[50,14,50,15],[51,14,51,15],[12,6,12,8],[54,14,54,15],[36,14,36,15],[37,14,37,15],[38,14,38,15],[8,5,9,5],[83,13,83,15],[84,13,84,15],[85,13,85,15],[2,32,7,32],[2,33,7,33],[32,16,34,16],[2,28,7,28],[2,19,7,19],[2,20,7,20],[2,21,7,21],[2,22,7,22],[2,23,7,23],[2,24,7,24],[2,25,7,25],[2,26,7,26],[2,27,7,27],[2,29,7,29],[2,30,7,30],[2,31,7,31],[78,14,78,15],[79,14,79,15],[80,14,80,15],[74,16,76,16],[75,14,75,15],[2,1,2,2],[2,3,2,5],[2,6,2,8],[3,1,3,9],[4,1,6,2],[4,6,4,8],[5,6,5,8],[6,6,6,8],[4,3,6,4],[4,5,6,5],[16,1,18,2],[7,6,7,8],[9,6,9,8],[10,6,10,8],[11,6,11,8],[10,3,12,4],[13,1,15,2],[16,6,16,8],[18,6,18,8],[7,1,9,2],[10,1,12,2],[17,5,18,5],[17,6,17,8],[13,3,15,4],[11,5,12,5],[14,5,15,5],[7,3,9,4],[76,14,76,15],[19,6,19,8],[64,16,66,16],[65,14,65,15],[66,14,66,15],[69,14,69,15],[69,16,71,16],[70,14,70,15],[71,14,71,15],[30,14,31,15],[59,14,59,15],[59,16,61,16],[60,14,60,15],[61,14,61,15],[49,16,51,16],[49,14,49,15],[54,16,56,16],[36,16,38,16]]}
[]
[null,{"$f":"CONCATENATE(\"Du \",N11,\"/\",O11,\"/\",P11,\" au \",N12,\"/\",O12,\"/\",P12)","v":"Du 30/9/2019 au 6/10/2019"},null,null,null,null,null,null,"Semaine :",39,{"$f":"Planning_général!C2","v":2019}]
[null,"Équipes",null,"Horaires",null,null,"Nom et Prénom",null,null,"Matricul",null,null,null,null,null,null,null,null,null,{"$f":"Planning_général!E17","v":"Resp Equipe 1"},{"$f":"Planning_général!E18","v":"Equipe 1_Tech 1"},{"$f":"Planning_général!E19","v":"Equipe 1_Tech 2"},{"$f":"Planning_général!E20","v":"Equipe 1_Tech 3"},{"$f":"Planning_général!E21","v":"Equipe 1_Tech 4"},{"$f":"Planning_général!E22","v":"Equipe 1_Tech 5"},{"$f":"Planning_général!E23","v":"Equipe 1_Tech 6"},{"$f":"Planning_général!E24","v":"Equipe 1_Tech 7"},{"$f":"Planning_général!E25","v":"Equipe 1_Tech 8"},{"$f":"Planning_général!E26","v":"Equipe 1_Tech 9"},{"$f":"Planning_général!E27","v":"Equipe 1_Tech 10"},{"$f":"Planning_général!E28","v":"Equipe 1_Tech 11"},{"$f":"Planning_général!E29","v":"Equipe 1_Tech 12"},{"$f":"Planning_général!E30","v":0},{"$f":"Planning_général!E31","v":0}]
[]
[null,"JOURNEE",null,"8h - 12h / 13h - 16h",null,null,{"$f":"IF(O33=\"\",\"\",O33)","v":""},null,null,{"$f":"IF(G5=\"\",\"\",IF(VLOOKUP(G5,Planning_général!$E$17:$F$62,2,0)=0,\"\",VLOOKUP(G5,Planning_général!$E$17:$F$62,2,0)))","v":""},null,null,"Initial",{"$f":"DATE(K2,1,1)","v":"2019-01-01"},{"$f":"N5","v":43466}]
[null,null,null,null,null,null,{"$f":"IF(O34=\"\",\"\",O34)","v":""},null,null,{"$f":"IF(G6=\"\",\"\",IF(VLOOKUP(G6,Planning_général!$E$17:$F$62,2,0)=0,\"\",VLOOKUP(G6,Planning_général!$E$17:$F$62,2,0)))","v":""},null,null,"Du",{"$f":"(O5)+($J$2)*7-WEEKDAY(N5,2)+1","v":"2019-09-30"},null,null,null,null,null,null,null,null,null,null,null,null,null,null,null,null,null,null,null,null,null,null,null,null,null,null,null,null,null,null,null,null,null,null,null,null,null,null,"Semaines"]
{"$rows_left_out":88}
{"sheet":"Energie","index":3,"n_rows":81,"n_cols":56,"rows_kept":81,"cut":false,"hidden":false,"merged":[[8,8,8,10],[9,8,9,10],[2,1,2,3],[8,4,9,5],[6,3,7,3],[4,4,5,5],[6,4,7,5],[4,1,7,2],[4,3,5,3],[2,4,2,7],[2,8,2,10],[8,6,9,7],[12,3,13,3],[14,1,17,2],[14,3,15,3],[16,3,17,3],[19,1,24,3],[8,1,13,2],[8,3,9,3],[10,3,11,3],[17,8,17,10],[16,8,16,10],[15,8,15,10],[10,8,10,10],[11,8,11,10],[12,8,12,10],[13,8,13,10],[14,8,14,10],[16,4,17,5],[10,4,11,5],[12,4,13,5],[14,4,15,5],[10,6,11,7],[12,6,13,7],[14,6,15,7],[16,6,17,7],[77,16,77,18],[64,17,64,18],[64,19,66,19],[65,17,65,18],[66,17,66,18],[70,16,70,18],[71,16,71,18],[72,16,72,18],[73,16,73,18],[74,16,74,18],[75,16,75,18],[76,16,76,18],[54,17,54,18],[54,19,56,19],[55,17,55,18],[56,17,56,18],[59,17,59,18],[59,19,61,19],[60,17,60,18],[61,17,61,18],[44,17,44,18],[44,19,46,19],[45,17,45,18],[46,17,46,18],[49,17,49,18],[49,19,51,19],[50,17,50,18],[51,17,51,18],[34,17,34,18],[34,19,36,19],[35,17,35,18],[36,17,36,18],[39,17,39,18],[39,19,41,19],[40,17,40,18],[41,17,41,18],[30,19,32,19],[31,17,31,18],[32,17,32,18],[28,17,29,18],[30,17,30,18],[2,36,7,36],[2,25,7,25],[2,26,7,26],[2,27,7,27],[2,28,7,28],[2,29,7,29],[2,31,7,31],[2,32,7,32],[2,33,7,33],[2,34,7,34],[2,35,7,35],[2,30,7,30],[2,22,7,22],[2,23,7,23],[2,24,7,24],[3,1,3,11],[4,6,5,7],[6,6,7,7],[4,8,4,10],[5,8,5,10],[6,8,6,10],[7,8,7,10]]}
[]
[null,{"$f":"CONCATENATE(\"Du \",Q11,\"/\",R11,\"/\",S11,\" au \",Q12,\"/\",R12,\"/\",S12)","v":"Du 9/9/2019 au 15/9/2019"},null,null,null,null,null,null,null,null,"Semaine :",36,{"$f":"Planning_général!C2","v":2019},null,null,null,null,null,null,null,null,null,1,2,3,4,5,6,7,8,9]
[null,"Équipes",null,null,"Horaires",null,null,null,"NOM et Prénom",null,null,"Matricul","N°POSTE TEL ENTREE",null,null,null,null,null,null,null,null,null,{"$f":"Planning_général!$E47","v":"Resp Equipe 3"},{"$f":"Planning_général!$E48","v":"Equipe 3_Tech 1"},{"$f":"Planning_général!$E49","v":"Equipe 3_Tech 2"},{"$f":"Planning_général!$E50","v":"Equipe 3_Tech 3"},{"$f":"Planning_général!$E51","v":0},{"$f":"Planning_général!$E52","v":0},{"$f":"Planning_général!$E53","v":0},{"$f":"Planning_général!$E54","v":0}]
[]
[null,"JOURNEE",null,"J1","08 h 00 - 12 h 00 / 13 h00 - 16 h 00",null," Pause 10 h 00 -10 h 10 / 15 h 00 -15 h 10",null,{"$f":"IF(R31=\"\",\"\",R31)","v":""},null,null,{"$f":"IF(I5=\"\",\"\",VLOOKUP(I5,Planning_général!$E$47:$F$54,2,0))","v":""},null,null,null,"Initial",{"$f":"DATE(M2,1,1)","v":"2019-01-01"},{"$f":"Q5","v":43466}]
[null,null,null,null,null,null,null,null,{"$f":"IF(R32=\"\",\"\",R32)","v":""},null,null,{"$f":"IF(I6=\"\",\"\",VLOOKUP(I6,Planning_général!$E$47:$F$54,2,0))","v":""},null,null,null,"Du",{"$f":"(R5)+($L$2)*7-WEEKDAY(Q5,2)+1","v":"2019-09-09"},null,null,null,null,null,null,null,null,null,null,null,null,null,null,null,null,null,null,null,null,null,null,null,null,null,null,null,null,null,null,null,null,null,null,null,null,null,null,"Semaines"]
{"$rows_left_out":76}
{"sheet":"Abattoir","index":4,"n_rows":83,"n_cols":56,"rows_kept":83,"cut":false,"hidden":false,"merged":[[57,19,60,19],[67,17,67,18],[64,19,67,19],[9,1,12,2],[11,6,12,11],[7,6,8,7],[7,8,8,8],[7,9,8,10],[7,11,8,11],[17,6,18,7],[17,8,18,8],[19,6,19,7],[17,9,18,10],[20,1,22,2],[26,1,31,2],[31,4,31,11],[22,9,22,10],[25,9,25,10],[13,1,16,2],[17,1,19,2],[34,17,35,18],[39,19,42,19],[42,17,42,18],[48,17,48,18],[19,41,20,41],[26,4,26,11],[27,4,27,11],[28,4,28,11],[29,4,29,11],[5,6,6,7],[5,8,6,8],[5,9,6,10],[5,11,6,11],[13,6,14,7],[13,8,14,8],[15,6,16,7],[15,8,16,8],[15,9,16,10],[13,9,14,10],[15,11,16,11],[13,11,14,11],[3,22,8,22],[3,3,4,5],[3,31,8,31],[3,32,8,32],[3,33,8,33],[3,34,8,34],[3,35,8,35],[3,1,4,2],[4,9,4,11],[5,1,8,2],[9,6,10,11],[30,4,30,11],[22,6,22,7],[20,6,21,7],[25,6,25,7],[20,8,21,8],[20,9,21,10],[20,11,21,11],[23,6,24,7],[23,8,24,8],[23,9,24,10],[23,11,24,11],[17,11,18,11],[19,9,19,10],[23,1,25,2],[5,5,8,5],[9,5,12,5],[13,5,16,5],[17,5,19,5],[20,5,22,5],[23,5,25,5],[77,16,77,18],[78,16,78,18],[79,16,79,18],[51,17,51,18],[74,16,74,18],[75,16,75,18],[76,16,76,18],[64,17,64,18],[39,17,39,18],[60,17,60,18],[72,16,72,18],[73,16,73,18],[65,17,65,18],[66,17,66,18],[52,17,52,18],[53,17,53,18],[57,17,57,18],[58,17,58,18],[59,17,59,18],[40,17,40,18],[41,17,41,18],[45,17,45,18],[46,17,46,18],[47,17,47,18],[45,19,48,19],[54,17,54,18],[51,19,54,19],[36,19,37,19],[37,17,37,18],[36,17,36,18],[3,23,8,23],[3,24,8,24],[4,6,4,8],[5,3,8,4],[9,3,12,4],[13,3,16,4],[17,3,19,4],[20,3,22,4],[23,3,25,4],[3,36,8,36],[3,25,8,25],[3,26,8,26],[3,27,8,27],[3,28,8,28],[3,29,8,29],[3,30,8,30],[3,6,3,7],[3,9,3,10]]}
[]
[null,{"$f":"CONCATENATE(\"Du \",Q12,\"/\",R12,\"/\",S12,\" au \",Q13,\"/\",R13,\"/\",S13)","v":"Du 21/10/2019 au 27/10/2019"},null,null,null,null,null,null,"Semaine",42,{"$f":"Planning_général!C2","v":2019}]
[]
[null,"Équipes",null,"Horaires",null,null,"Nom et Prénom",null,"Matricule","Nom et Prénom",null,"Matricule",null,null,null,null,null,null,null,null,null,null,{"$f":"IF(Planning_général!$E32=0,\"\",Planning_général!$E32)","v":"Resp Equipe 2"},{"$f":"IF(Planning_général!$E33=0,\"\",Planning_général!$E33)","v":"Equipe 2_Tech 1"},{"$f":"IF(Planning_général!$E34=0,\"\",Planning_général!$E34)","v":"Equipe 2_Tech 2"},{"$f":"IF(Planning_général!$E35=0,\"\",Planning_général!$E35)","v":"Equipe 2_Tech 3"},{"$f":"IF(Planning_général!$E36=0,\"\",Planning_général!$E36)","v":"Equipe 2_Tech 4"},{"$f":"IF(Planning_général!$E37=0,\"\",Planning_général!$E37)","v":"Equipe 2_Tech 5"},{"$f":"IF(Planning_général!$E38=0,\"\",Planning_général!$E38)","v":"Equipe 2_Tech 6"},{"$f":"IF(Planning_général!$E39=0,\"\",Planning_général!$E39)","v":"Equipe 2_Tech 7"},{"$f":"IF(Planning_général!#REF!=0,\"\",Planning_général!#REF!)","v":{"$error":"#REF!"}},{"$f":"IF(Planning_général!$E41=0,\"\",Planning_général!$E41)","v":"Equipe 2_Tech 9"},{"$f":"IF(Planning_général!$E42=0,\"\",Planning_général!$E42)","v":"Equipe 2_Tech 10"},{"$f":"IF(Planning_général!$E43=0,\"\",Planning_général!$E43)","v":"Equipe 2_Tech 11"},{"$f":"IF(Planning_général!$E44=0,\"\",Planning_général!$E44)","v":"Equipe 2_Tech 12"},{"$f":"IF(Planning_général!$E40=0,\"\",Planning_général!$E40)","v":"Equipe 2_Tech 8"},{"$f":"IF(Planning_général!$E46=0,\"\",Planning_général!$E46)","v":""}]
[null,null,null,null,null,null,"Secteur Abattoir: 6114",null,null,"Secteur Découpe: 6167"]
[null,"Matin",null,"5 h 30 - 12 h 00 \nsauf le lundi 3 h 00 -12 h 00",null,"Pause \nLun. 9 h 00 à 9 h 30 \nSemaine de 9 h 00 à 9 h 20",{"$f":"IF(R40=\"\",\"\",R40)","v":""},null,{"$f":"IF(ISERROR(VLOOKUP(G6,Planning_général!$E$32:$F$46,2,0)),\"\",VLOOKUP(G6,Planning_général!$E$32:$F$46,2,0))","v":""},{"$f":"IF(R42=\"\",\"\",R42)","v":""},null,{"$f":"IF(ISERROR(VLOOKUP(J6,Planning_général!$E$32:$F$46,2,0)),\"\",VLOOKUP(J6,Planning_général!$E$32:$F$46,2,0))","v":""},null,null,null,"Initial",{"$f":"DATE(K2,1,1)","v":"2019-01-01"},{"$f":"Q6","v":43466}]
{"$rows_left_out":78}
{"sheet":"Magasin","index":5,"n_rows":81,"n_cols":56,"rows_kept":81,"cut":false,"hidden":false,"merged":[[10,4,11,5],[8,3,9,3],[14,3,15,3],[8,6,9,7],[14,6,15,7],[22,5,22,11],[10,3,11,3],[12,3,13,3],[6,3,7,3],[6,4,7,5],[6,6,7,7],[6,8,6,10],[7,8,7,10],[8,8,8,10],[9,8,9,10],[14,8,14,10],[15,8,15,10],[17,5,17,11],[18,5,18,11],[19,5,19,11],[20,5,20,11],[21,5,21,11],[11,8,11,10],[10,8,10,10],[10,6,11,7],[2,4,2,5],[2,6,2,7],[4,6,5,7],[4,8,4,10],[5,8,5,10],[28,17,29,18],[30,17,30,18],[30,19,32,19],[31,17,31,18],[32,17,32,18],[12,4,13,5],[12,6,13,7],[12,8,12,10],[13,8,13,10],[3,1,3,11],[4,3,5,3],[4,4,5,5],[2,1,2,3],[2,8,2,10],[4,1,7,2],[8,1,15,2],[17,1,22,3],[8,4,9,5],[14,4,15,5],[51,17,51,18],[54,17,54,18],[54,19,56,19],[55,17,55,18],[56,17,56,18],[59,17,59,18],[59,19,61,19],[60,17,60,18],[34,17,34,18],[34,19,36,19],[35,17,35,18],[36,17,36,18],[39,17,39,18],[39,19,41,19],[40,17,40,18],[41,17,41,18],[14,40,15,40],[14,41,15,41],[14,42,15,42],[14,43,15,43],[77,16,77,18],[64,17,64,18],[64,19,66,19],[65,17,65,18],[66,17,66,18],[70,16,70,18],[71,16,71,18],[72,16,72,18],[73,16,73,18],[74,16,74,18],[75,16,75,18],[76,16,76,18],[61,17,61,18],[44,17,44,18],[44,19,46,19],[45,17,45,18],[46,17,46,18],[49,17,49,18],[49,19,51,19],[50,17,50,18],[2,22,7,22],[2,23,7,23],[2,24,7,24],[2,36,7,36],[2,25,7,25],[2,26,7,26],[2,27,7,27],[2,28,7,28],[2,29,7,29],[2,30,7,30],[2,31,7,31],[2,32,7,32],[2,33,7,33],[2,34,7,34],[2,35,7,35]]}
[]
[null,{"$f":"CONCATENATE(\"Du \",Q11,\"/\",R11,\"/\",S11,\" au \",Q12,\"/\",R12,\"/\",S12)","v":"Du 16/9/2019 au 22/9/2019"},null,null,null,null,null,null,null,"Semaine :",37,{"$f":"Planning_général!C2","v":2019},null,null,null,null,null,null,null,null,null,null,1]
[null,"Équipes",null,null,"Horaires",null,"Pause",null,"NOM et Prénom",null,null,"Matricul",null,null,null,null,null,null,null,null,null,null,{"$f":"Planning_général!$E55","v":"Resp Equipe 4"},{"$f":"Planning_général!$E56","v":"Equipe 4_Tech 1"},{"$f":"Planning_général!$E57","v":"Equipe 4_Tech 2"},{"$f":"Planning_général!$E58","v":"Equipe 4_Tech 3"},{"$f":"Planning_général!$E59","v":"Equipe 4_Tech 4"},{"$f":"Planning_général!$E60","v":0},{"$f":"Planning_général!$E61","v":0},{"$f":"Planning_général!$E62","v":" "}]
[]
[null,"Matin",null,"M1","7 h 00 - 11 h 30 sauf mercredi et de 07 h00 à 11h 00 le vendredi",null,"-",null,{"$f":"IF(R31=\"\",\"\",R31)","v":""},null,null,{"$f":"IF(I5=\"\",\"\",VLOOKUP(I5,Planning_général!$E$55:$F$62,2,0))","v":""},null,null,null,"Initial",{"$f":"DATE(L2,1,1)","v":"2019-01-01"},{"$f":"Q5","v":43466}]
[null,null,null,null,null,null,null,null,{"$f":"IF(R32=\"\",\"\",R32)","v":""},null,null,{"$f":"IF(I6=\"\",\"\",VLOOKUP(I6,Planning_général!$E$55:$F$62,2,0))","v":""},null,null,null,"Du",{"$f":"(R5)+($K$2)*7-WEEKDAY(Q5,2)+1","v":"2019-09-16"},null,null,null,null,null,null,null,null,null,null,null,null,null,null,null,null,null,null,null,null,null,null,null,null,null,null,null,null,null,null,null,null,null,null,null,null,null,null,"Semaines"]
{"$rows_left_out":75}