{"text_format":"1","workbook":"xlsx","n_sheets":6,"sheets":["Accueil","Planning_général","Conditionnement","Energie","Abattoir","Magasin"],"not_rendered":{"charts":0,"images":1,"macros":1,"external_links":0,"defined_names":70,"comments":5,"pivot_tables":0},"unopened":[],"bounds":{"document_bytes":16777216,"sheet_cells":100000,"rows_first":2000,"rows_last":500,"rows_between":2000,"halvings":0,"cell_chars":16384,"cell_head_chars":4096},"cells_cut":0,"cells_raw":0,"read":"whole","date_system":"1900"}

{"sheet":"Accueil","index":0,"n_rows":0,"n_cols":0,"rows_kept":0,"cut":false,"hidden":false,"merged":[]}

{"sheet":"Planning_général","index":1,"n_rows":62,"n_cols":387,"rows_kept":62,"cut":false,"hidden":false,"merged":[[6,311,6,340],[6,341,6,371],[6,372,6,376],[6,6,6,36],[6,37,6,64],[6,65,6,96],[6,97,6,126],[6,127,6,157],[6,158,6,187],[6,188,6,218],[6,219,6,249],[6,250,6,279],[6,280,6,310],[7,342,7,348],[7,349,7,355],[7,356,7,362],[7,363,7,369],[7,370,7,376],[7,307,7,313],[7,314,7,320],[7,321,7,327],[7,328,7,334],[7,335,7,341],[7,272,7,278],[7,279,7,285],[7,286,7,292],[7,293,7,299],[7,300,7,306],[7,237,7,243],[7,244,7,250],[7,251,7,257],[7,258,7,264],[7,265,7,271],[7,202,7,208],[7,209,7,215],[7,216,7,222],[7,223,7,229],[7,230,7,236],[7,167,7,173],[7,174,7,180],[7,181,7,187],[7,188,7,194],[7,195,7,201],[7,132,7,138],[7,139,7,145],[7,146,7,152],[7,153,7,159],[7,160,7,166],[7,97,7,103],[7,104,7,110],[7,111,7,117],[7,118,7,124],[7,125,7,131],[7,62,7,68],[7,69,7,75],[7,76,7,82],[7,83,7,89],[7,90,7,96],[7,27,7,33],[7,34,7,40],[7,41,7,47],[7,48,7,54],[7,55,7,61],[46,3,53,3],[54,3,61,3],[7,6,7,12],[7,13,7,19],[7,20,7,26],[16,3,30,3],[31,3,45,3],[10,3,15,3]]}
[]
[null,"Année",2019]
[]
[null,null,null,null,1,2,3,4,5,6,7,8,9,10,11,12,13,14,15,16,17,18,19,20,21,22,23,24,25,26,27,28,29,30,31,32,33,34,35,36,37,38,39,40,41,42,43,44,45,46,47,48,49,50,51,52,53,54,55,56,57,58,59,60,61,62,63,64,65,66,67,68,69,70,71,72,73,74,75,76,77,78,79,80,81,82,83,84,85,86,87,88,89,90,91,92,93,94,95,96,97,98,99,100,101,102,103,104,105,106,107,108,109,110,111,112,113,114,115,116,117,118,119,120,121,122,123,124,125,126,127,128,129,130,131,132,133,134,135,136,137,138,139,140,141,142,143,144,145,146,147,148,149,150,151,152,153,154,155,156,157,158,159,160,161,162,163,164,165,166,167,168,169,170,171,172,173,174,175,176,177,178,179,180,181,182,183,184,185,186,187,188,189,190,191,192,193,194,195,196,197,198,199,200,201,202,203,204,205,206,207,208,209,210,211,212,213,214,215,216,217,218,219,220,221,222,223,224,225,226,227,228,229,230,231,232,233,234,235,236,237,238,239,240,241,242,243,244,245,246,247,248,249,250,251,252,253,254,255,256,257,258,259,260,261,262,263,264,265,266,267,268,269,270,271,272,273,274,275,276,277,278,279,280,281,282,283,284,285,286,287,288,289,290,291,292,293,294,295,296,297,298,299,300,301,302,303,304,305,306,307,308,309,310,311,312,313,314,315,316,317,318,319,320,321,322,323,324,325,326,327,328,329,330,331,332,333,334,335,336,337,338,339,340,341,342,343,344,345,346,347,348,349,350,351,352,353,354,355,356,357,358,359,360,361,362,363,364,365,366,367,368,369,370,371,372,373]
[null,null,null,null,null,null,{"$f":"DATE(C2,1,1)","v":"2019-01-01"},{"$f":"G5+1","v":"2019-01-02"},{"$f":"H5+1","v":"2019-01-03"},"2019-01-04","2019-01-05","2019-01-06","2019-01-07","2019-01-08","2019-01-09","2019-01-10","2019-01-11","2019-01-12","2019-01-13","2019-01-14","2019-01-15","2019-01-16","2019-01-17","2019-01-18","2019-01-19","2019-01-20","2019-01-21","2019-01-22","2019-01-23","2019-01-24","2019-01-25","2019-01-26","2019-01-27","2019-01-28","2019-01-29","2019-01-30","2019-01-31","2019-02-01","2019-02-02","2019-02-03","2019-02-04","2019-02-05","2019-02-06","2019-02-07","2019-02-08","2019-02-09","2019-02-10","2019-02-11",{"$f":"AV5+1","v":"2019-02-12"},"2019-02-13","2019-02-14","2019-02-15","2019-02-16","2019-02-17","2019-02-18","2019-02-19","2019-02-20","2019-02-21","2019-02-22","2019-02-23","2019-02-24","2019-02-25","2019-02-26","2019-02-27","2019-02-28",{"$f":"BM5+1","v":"2019-03-01"},{"$f":"BN5+1","v":"2019-03-02"},{"$f":"BO5+1","v":"2019-03-03"},{"$f":"BP5+1","v":"2019-03-04"},{"$f":"BQ5+1","v":"2019-03-05"},{"$f":"BR5+1","v":"2019-03-06"},{"$f":"BS5+1","v":"2019-03-07"},{"$f":"BT5+1","v":"2019-03-08"},{"$f":"BU5+1","v":"2019-03-09"},{"$f":"BV5+1","v":"2019-03-10"},{"$f":"BW5+1","v":"2019-03-11"},{"$f":"BX5+1","v":"2019-03-12"},"2019-03-13","2019-03-14","2019-03-15","2019-03-16","2019-03-17","2019-03-18","2019-03-19","2019-03-20","2019-03-21","2019-03-22","2019-03-23","2019-03-24","2019-03-25","2019-03-26","2019-03-27","2019-03-28","2019-03-29","2019-03-30","2019-03-31","2019-04-01","2019-04-02","2019-04-03","2019-04-04","2019-04-05","2019-04-06","2019-04-07","2019-04-08","2019-04-09","2019-04-10","2019-04-11","2019-04-12","2019-04-13","2019-04-14","2019-04-15","2019-04-16",{"$f":"DH5+1","v":"2019-04-17"},"2019-04-18","2019-04-19","2019-04-20","2019-04-21","2019-04-22","2019-04-23","2019-04-24","2019-04-25","2019-04-26","2019-04-27","2019-04-28","2019-04-29","2019-04-30","2019-05-01","2019-05-02","2019-05-03","2019-05-04","2019-05-05","2019-05-06","2019-05-07","2019-05-08","2019-05-09","2019-05-10","2019-05-11","2019-05-12","2019-05-13","2019-05-14","2019-05-15","2019-05-16","2019-05-17","2019-05-18","2019-05-19","2019-05-20","2019-05-21","2019-05-22","2019-05-23","2019-05-24","2019-05-25","2019-05-26","2019-05-27",{"$f":"EW5+1","v":"2019-05-28"},"2019-05-29","2019-05-30","2019-05-31","2019-06-01","2019-06-02","2019-06-03","2019-06-04","2019-06-05","2019-06-06","2019-06-07","2019-06-08","2019-06-09","2019-06-10","2019-06-11","2019-06-12","2019-06-13","2019-06-14","2019-06-15","2019-06-16","2019-06-17",{"$f":"FR5+1","v":"2019-06-18"},"2019-06-19","2019-06-20","2019-06-21","2019-06-22","2019-06-23","2019-06-24","2019-06-25","2019-06-26","2019-06-27","2019-06-28","2019-06-29","2019-06-30","2019-07-01","2019-07-02","2019-07-03","2019-07-04","2019-07-05","2019-07-06","2019-07-07","2019-07-08","2019-07-09","2019-07-10","2019-07-11","2019-07-12","2019-07-13","2019-07-14","2019-07-15","2019-07-16","2019-07-17","2019-07-18","2019-07-19","2019-07-20","2019-07-21","2019-07-22","2019-07-23","2019-07-24","2019-07-25","2019-07-26","2019-07-27","2019-07-28","2019-07-29","2019-07-30","2019-07-31","2019-08-01","2019-08-02","2019-08-03","2019-08-04","2019-08-05","2019-08-06","2019-08-07","2019-08-08","2019-08-09","2019-08-10","2019-08-11","2019-08-12","2019-08-13","2019-08-14","2019-08-15","2019-08-16","2019-08-17","2019-08-18","2019-08-19","2019-08-20",{"$f":"ID5+1","v":"2019-08-21"},"2019-08-22","2019-08-23","2019-08-24","2019-08-25","2019-08-26","2019-08-27","2019-08-28","2019-08-29","2019-08-30","2019-08-31","2019-09-01","2019-09-02","2019-09-03","2019-09-04","2019-09-05","2019-09-06","2019-09-07","2019-09-08","2019-09-09","2019-09-10","2019-09-11","2019-09-12","2019-09-13","2019-09-14","2019-09-15","2019-09-16","2019-09-17","2019-09-18","2019-09-19","2019-09-20","2019-09-21","2019-09-22","2019-09-23","2019-09-24","2019-09-25","2019-09-26","2019-09-27","2019-09-28","2019-09-29","2019-09-30","2019-10-01","2019-10-02","2019-10-03","2019-10-04","2019-10-05","2019-10-06","2019-10-07","2019-10-08","2019-10-09","2019-10-10","2019-10-11","2019-10-12","2019-10-13","2019-10-14","2019-10-15","2019-10-16","2019-10-17","2019-10-18","2019-10-19","2019-10-20","2019-10-21","2019-10-22","2019-10-23",{"$f":"KP5+1","v":"2019-10-24"},"2019-10-25","2019-10-26","2019-10-27","2019-10-28","2019-10-29","2019-10-30","2019-10-31","2019-11-01","2019-11-02","2019-11-03","2019-11-04","2019-11-05","2019-11-06","2019-11-07","2019-11-08","2019-11-09","2019-11-10","2019-11-11","2019-11-12","2019-11-13","2019-11-14","2019-11-15","2019-11-16","2019-11-17","2019-11-18","2019-11-19","2019-11-20","2019-11-21","2019-11-22","2019-11-23","2019-11-24","2019-11-25","2019-11-26","2019-11-27","2019-11-28","2019-11-29","2019-11-30","2019-12-01","2019-12-02",{"$f":"MD5+1","v":"2019-12-03"},"2019-12-04","2019-12-05","2019-12-06","2019-12-07","2019-12-08","2019-12-09","2019-12-10","2019-12-11","2019-12-12","2019-12-13","2019-12-14","2019-12-15","2019-12-16",{"$f":"MR5+1","v":"2019-12-17"},"2019-12-18","2019-12-19","2019-12-20","2019-12-21","2019-12-22","2019-12-23",{"$f":"MY5+1","v":"2019-12-24"},"2019-12-25","2019-12-26","2019-12-27","2019-12-28","2019-12-29","2019-12-30","2019-12-31","2020-01-01","2020-01-02","2020-01-03","2020-01-04","2020-01-05","2020-01-06"]
[null,null,null,null,null,null,{"$f":"WEEKDAY(G5)","v":3},{"$f":"WEEKDAY(H5)","v":4},5,6,7,1,2,3,4,5,6,7,1,2,3,4,5,6,7,1,2,3,4,5,6,7,1,2,3,4,5,6,{"$f":"WEEKDAY(AM5)","v":7},1,2,3,4,5,6,7,1,2,3,4,5,6,7,1,2,3,4,5,6,7,1,2,3,4,5,{"$f":"WEEKDAY(BN5)","v":6},7,1,2,3,4,5,6,7,1,2,3,4,5,6,7,1,2,3,4,5,6,7,1,2,3,4,5,6,7,1,2,3,4,5,6,7,1,2,3,4,5,6,7,1,2,3,4,5,6,7,1,2,3,4,5,6,7,1,2,3,4,5,6,{"$f":"WEEKDAY(DZ5)","v":7},1,2,3,4,5,6,7,1,2,3,4,5,6,7,1,2,3,4,5,6,7,1,2,3,4,5,6,7,1,2,3,4,5,6,7,1,2,3,4,5,6,7,1,2,3,4,5,6,7,1,2,3,4,5,6,7,1,2,3,4,5,6,7,{"$f":"WEEKDAY(GL5)","v":1},2,3,4,5,6,7,1,2,3,4,5,6,7,1,2,3,4,5,6,7,1,2,3,4,5,6,7,1,2,3,4,5,6,7,1,2,3,4,5,6,7,1,2,3,4,5,6,7,1,2,3,4,5,6,7,1,2,3,4,5,6,7,1,{"$f":"WEEKDAY(IX5)","v":2},3,4,5,6,7,1,2,3,4,5,6,7,1,2,3,4,5,6,7,1,2,3,4,5,6,7,1,2,3,4,5,6,7,1,2,3,4,5,6,7,1,2,3,4,5,6,7,1,2,3,4,5,6,7,1,2,3,4,5,6,7,1,2,{"$f":"WEEKDAY(LJ5)","v":3},4,5,6,7,1,2,3,4,5,6,7,1,2,3,4,5,6,7,1,2,3,4,5,6,7,1,2,3,4,5,6,7,1,2,3,4,5,6,7,1,2,3,4,5,6,7,1,2,3,4,5,6,7,1,2]
[null,null,null,null,null,null,"Janvier",null,null,null,null,null,null,null,null,null,null,null,null,null,null,null,null,null,null,null,null,null,null,null,null,null,null,null,null,null,null,"Fevrier",null,null,null,null,null,null,null,null,null,null,null,null,null,null,null,null,null,null,null,null,null,null,null,null,null,null,null,"Mars",null,null,null,null,null,null,null,null,null,null,null,null,null,null,null,null,null,null,null,null,null,null,null,null,null,null,null,null,null,null,null,"Avril",null,null,null,null,null,null,null,null,null,null,null,null,null,null,null,null,null,null,null,null,null,null,null,null,null,null,null,null,null,"Mai",null,null,null,null,null,null,null,null,null,null,null,null,null,null,null,null,null,null,null,null,null,null,null,null,null,null,null,null,null,null,"Juin",null,null,null,null,null,null,null,null,null,null,null,null,null,null,null,null,null,null,null,null,null,null,null,null,null,null,null,null,null,"Juillet",null,null,null,null,null,null,null,null,null,null,null,null,null,null,null,null,null,null,null,null,null,null,null,null,null,null,null,null,null,null,"Aout",null,null,null,null,null,null,null,null,null,null,null,null,null,null,null,null,null,null,null,null,null,null,null,null,null,null,null,null,null,null,"Septembre",null,null,null,null,null,null,null,null,null,null,null,null,null,null,null,null,null,null,null,null,null,null,null,null,null,null,null,null,null,"Octobre",null,null,null,null,null,null,null,null,null,null,null,null,null,null,null,null,null,null,null,null,null,null,null,null,null,null,null,null,null,null,"Novembre",null,null,null,null,null,null,null,null,null,null,null,null,null,null,null,null,null,null,null,null,null,null,null,null,null,null,null,null,null,"Decembre",null,null,null,null,null,null,null,null,null,null,null,null,null,null,null,null,null,null,null,null,null,null,null,null,null,null,null,null,null,null,"Janvier"]
[null,null,null,null,null,null,{"$f":"\"Sem \"& WEEKNUM(G5)","v":"Sem 1"},null,null,null,null,null,null,{"$f":"\"Sem \"& WEEKNUM(N5)","v":"Sem 2"},null,null,null,null,null,null,{"$f":"\"Sem \"& WEEKNUM(U5)","v":"Sem 3"},null,null,null,null,null,null,{"$f":"\"Sem \"& WEEKNUM(AB5)","v":"Sem 4"},null,null,null,null,null,null,{"$f":"\"Sem \"& WEEKNUM(AI5)","v":"Sem 5"},null,null,null,null,null,null,{"$f":"\"Sem \"& WEEKNUM(AP5)","v":"Sem 6"},null,null,null,null,null,null,{"$f":"\"Sem \"& WEEKNUM(AW5)","v":"Sem 7"},null,null,null,null,null,null,{"$f":"\"Sem \"& WEEKNUM(BD5)","v":"Sem 8"},null,null,null,null,null,null,{"$f":"\"Sem \"& WEEKNUM(BK5)","v":"Sem 9"},null,null,null,null,null,null,{"$f":"\"Sem \"& WEEKNUM(BR5)","v":"Sem 10"},null,null,null,null,null,null,{"$f":"\"Sem \"& WEEKNUM(BY5)","v":"Sem 11"},null,null,null,null,null,null,{"$f":"\"Sem \"& WEEKNUM(CF5)","v":"Sem 12"},null,null,null,null,null,null,{"$f":"\"Sem \"& WEEKNUM(CM5)","v":"Sem 13"},null,null,null,null,null,null,{"$f":"\"Sem \"& WEEKNUM(CT5)","v":"Sem 14"},null,null,null,null,null,null,{"$f":"\"Sem \"& WEEKNUM(DA5)","v":"Sem 15"},null,null,null,null,null,null,{"$f":"\"Sem \"& WEEKNUM(DH5)","v":"Sem 16"},null,null,null,null,null,null,{"$f":"\"Sem \"& WEEKNUM(DO5)","v":"Sem 17"},null,null,null,null,null,null,{"$f":"\"Sem \"& WEEKNUM(DV5)","v":"Sem 18"},null,null,null,null,null,null,{"$f":"\"Sem \"& WEEKNUM(EC5)","v":"Sem 19"},null,null,null,null,null,null,{"$f":"\"Sem \"& WEEKNUM(EJ5)","v":"Sem 20"},null,null,null,null,null,null,{"$f":"\"Sem \"& WEEKNUM(EQ5)","v":"Sem 21"},null,null,null,null,null,null,{"$f":"\"Sem \"& WEEKNUM(EX5)","v":"Sem 22"},null,null,null,null,null,null,{"$f":"\"Sem \"& WEEKNUM(FE5)","v":"Sem 23"},null,null,null,null,null,null,{"$f":"\"Sem \"& WEEKNUM(FL5)","v":"Sem 24"},null,null,null,null,null,null,{"$f":"\"Sem \"& WEEKNUM(FS5)","v":"Sem 25"},null,null,null,null,null,null,{"$f":"\"Sem \"& WEEKNUM(FZ5)","v":"Sem 26"},null,null,null,null,null,null,{"$f":"\"Sem \"& WEEKNUM(GG5)","v":"Sem 27"},null,null,null,null,null,null,{"$f":"\"Sem \"& WEEKNUM(GN5)","v":"Sem 28"},null,null,null,null,null,null,{"$f":"\"Sem \"& WEEKNUM(GU5)","v":"Sem 29"},null,null,null,null,null,null,{"$f":"\"Sem \"& WEEKNUM(HB5)","v":"Sem 30"},null,null,null,null,null,null,{"$f":"\"Sem \"& WEEKNUM(HI5)","v":"Sem 31"},null,null,null,null,null,null,{"$f":"\"Sem \"& WEEKNUM(HP5)","v":"Sem 32"},null,null,null,null,null,null,{"$f":"\"Sem \"& WEEKNUM(HW5)","v":"Sem 33"},null,null,null,null,null,null,{"$f":"\"Sem \"& WEEKNUM(ID5)","v":"Sem 34"},null,null,null,null,null,null,{"$f":"\"Sem \"& WEEKNUM(IK5)","v":"Sem 35"},null,null,null,null,null,null,{"$f":"\"Sem \"& WEEKNUM(IR5)","v":"Sem 36"},null,null,null,null,null,null,{"$f":"\"Sem \"& WEEKNUM(IY5)","v":"Sem 37"},null,null,null,null,null,null,{"$f":"\"Sem \"& WEEKNUM(JF5)","v":"Sem 38"},null,null,null,null,null,null,{"$f":"\"Sem \"& WEEKNUM(JM5)","v":"Sem 39"},null,null,null,null,null,null,{"$f":"\"Sem \"& WEEKNUM(JT5)","v":"Sem 40"},null,null,null,null,null,null,{"$f":"\"Sem \"& WEEKNUM(KA5)","v":"Sem 41"},null,null,null,null,null,null,{"$f":"\"Sem \"& WEEKNUM(KH5)","v":"Sem 42"},null,null,null,null,null,null,{"$f":"\"Sem \"& WEEKNUM(KO5)","v":"Sem 43"},null,null,null,null,null,null,{"$f":"\"Sem \"& WEEKNUM(KV5)","v":"Sem 44"},null,null,null,null,null,null,{"$f":"\"Sem \"& WEEKNUM(LC5)","v":"Sem 45"},null,null,null,null,null,null,{"$f":"\"Sem \"& WEEKNUM(LJ5)","v":"Sem 46"},null,null,null,null,null,null,{"$f":"\"Sem \"& WEEKNUM(LQ5)","v":"Sem 47"},null,null,null,null,null,null,{"$f":"\"Sem \"& WEEKNUM(LX5)","v":"Sem 48"},null,null,null,null,null,null,{"$f":"\"Sem \"& WEEKNUM(ME5)","v":"Sem 49"},null,null,null,null,null,null,{"$f":"\"Sem \"& WEEKNUM(ML5)","v":"Sem 50"},null,null,null,null,null,null,{"$f":"\"Sem \"& WEEKNUM(MS5)","v":"Sem 51"},null,null,null,null,null,null,{"$f":"\"Sem \"& WEEKNUM(MZ5)","v":"Sem 52"},null,null,null,null,null,null,{"$f":"\"Sem \"& WEEKNUM(NG5)","v":"Sem 53"}]
[null,null,null,null,null,null,{"$f":"DAY(G5)","v":1},{"$f":"DAY(H5)","v":2},3,4,5,6,7,8,9,10,11,12,13,14,15,16,17,18,19,20,21,22,23,24,25,26,27,28,29,30,31,1,2,3,4,5,6,7,8,9,10,11,12,13,14,15,16,17,18,19,20,21,22,23,24,25,26,27,28,1,2,3,4,5,{"$f":"DAY(BS5)","v":6},7,8,9,10,11,12,13,14,15,16,17,18,19,20,21,22,23,24,25,26,27,28,29,30,31,1,2,3,4,5,6,7,8,9,10,11,12,13,14,15,16,17,18,19,20,21,22,23,24,25,26,27,28,29,30,1,2,3,4,5,6,7,8,{"$f":"DAY(EE5)","v":9},10,11,12,13,14,15,16,17,18,19,20,21,22,23,24,25,26,27,28,29,30,31,1,2,3,4,5,6,7,8,9,10,11,12,13,14,15,16,17,18,19,20,21,22,23,24,25,26,27,28,29,30,1,2,3,4,5,6,7,8,9,10,11,{"$f":"DAY(GQ5)","v":12},13,14,15,16,17,18,19,20,21,22,23,24,25,26,27,28,29,30,31,1,2,3,4,5,6,7,8,9,10,11,12,13,14,15,16,17,18,19,20,21,22,23,24,25,26,27,28,29,30,31,1,2,3,4,5,6,7,8,9,10,11,12,13,{"$f":"DAY(JC5)","v":14},15,16,17,18,19,20,21,22,23,24,25,26,27,28,29,30,1,2,3,4,5,6,7,8,9,10,11,12,13,14,15,16,17,18,19,20,21,22,23,24,25,26,27,28,29,30,31,1,2,3,4,5,6,7,8,9,10,11,12,13,14,15,16,{"$f":"DAY(LO5)","v":17},18,19,20,21,22,23,24,25,26,27,28,29,30,1,2,3,4,5,6,7,8,9,10,11,12,13,14,15,16,17,18,19,20,21,22,23,24,25,26,27,28,29,30,31,1,2,3,4,5,6]
[null,null,null,null,"Personnels","Code",{"$f":"VLOOKUP(G6,$NT$20:$NV$26,3,0)","v":"M"},{"$f":"VLOOKUP(H6,$NT$20:$NV$26,3,0)","v":"Me"},"J","V","S","D","L","M","Me","J","V","S","D","L","M","Me","J","V","S","D","L","M","Me","J","V","S","D","L","M","Me","J","V","S","D","L","M","Me","J","V","S","D","L","M","Me","J","V","S","D","L","M","Me","J","V","S","D","L","M","Me","J","V","S","D","L","M","Me",{"$f":"VLOOKUP(BT6,$NT$20:$NV$26,3,0)","v":"J"},"V","S","D","L","M","Me","J","V","S","D","L","M","Me","J","V","S","D","L","M","Me","J","V","S","D","L","M","Me","J","V","S","D","L","M","Me","J","V","S","D","L","M","Me","J","V","S","D","L","M","Me","J","V","S","D","L","M","Me","J","V","S","D","L","M","Me","J",{"$f":"VLOOKUP(EF6,$NT$20:$NV$26,3,0)","v":"V"},"S","D","L","M","Me","J","V","S","D","L","M","Me","J","V","S","D","L","M","Me","J","V","S","D","L","M","Me","J","V","S","D","L","M","Me","J","V","S","D","L","M","Me","J","V","S","D","L","M","Me","J","V","S","D","L","M","Me","J","V","S","D","L","M","Me","J","V",{"$f":"VLOOKUP(GR6,$NT$20:$NV$26,3,0)","v":"S"},"D","L","M","Me","J","V","S","D","L","M","Me","J","V","S","D","L","M","Me","J","V","S","D","L","M","Me","J","V","S","D","L","M","Me","J","V","S","D","L","M","Me","J","V","S","D","L","M","Me","J","V","S","D","L","M","Me","J","V","S","D","L","M","Me","J","V","S",{"$f":"VLOOKUP(JD6,$NT$20:$NV$26,3,0)","v":"D"},"L","M","Me","J","V","S","D","L","M","Me","J","V","S","D","L","M","Me","J","V","S","D","L","M","Me","J","V","S","D","L","M","Me","J","V","S","D","L","M","Me","J","V","S","D","L","M","Me","J","V","S","D","L","M","Me","J","V","S","D","L","M","Me","J","V","S","D",{"$f":"VLOOKUP(LP6,$NT$20:$NV$26,3,0)","v":"L"},"M","Me","J","V","S","D","L","M","Me","J","V","S","D","L","M","Me","J","V","S","D","L","M","Me","J","V","S","D","L","M","Me","J","V","S","D","L","M","Me","J","V","S","D","L","M","Me","J","V","S","D","L"]
[null,null,null,"Respos","Respo Maintenance"]
[null,null,null,null,"Resp Equipe 1",{"$f":"IF(E12=\"\",\"\",VLOOKUP(E12,$E$17:$F$62,$F$4,0))","v":3646},{"$f":"IF($E$12=\"\",\"\",IF(VLOOKUP($E$12,$E$17:$NM$62,G$4,0)=0,\"\",VLOOKUP($E$12,$E$17:$NM$62,G$4,0)))","v":""},{"$f":"IF($E$12=\"\",\"\",IF(VLOOKUP($E$12,$E$17:$NM$62,H$4,0)=0,\"\",VLOOKUP($E$12,$E$17:$NM$62,H$4,0)))","v":""},"","","","","","","","","","","","","","","","","","","","","","","","","",""]
[null,null,null,null,"Resp Equipe 2",{"$f":"IF(E13=\"\",\"\",VLOOKUP(E13,$E$17:$F$62,$F$4,0))","v":5390},{"$f":"IF($E$13=\"\",\"\",IF(VLOOKUP($E$13,$E$17:$NM$62,G$4,0)=0,\"\",VLOOKUP($E$13,$E$17:$NM$62,G$4,0)))","v":""},{"$f":"IF($E$13=\"\",\"\",IF(VLOOKUP($E$13,$E$17:$NM$62,H$4,0)=0,\"\",VLOOKUP($E$13,$E$17:$NM$62,H$4,0)))","v":""},"","","","","","","","","","","","","","","","","","","","","","","","","",""]
[null,null,null,null,"Resp Equipe 3",9329,{"$f":"IF($E$14=\"\",\"\",IF(VLOOKUP($E$14,$E$17:$NM$62,G$4,0)=0,\"\",VLOOKUP($E$14,$E$17:$NM$62,G$4,0)))","v":""},{"$f":"IF($E$14=\"\",\"\",IF(VLOOKUP($E$14,$E$17:$NM$62,H$4,0)=0,\"\",VLOOKUP($E$14,$E$17:$NM$62,H$4,0)))","v":""},"","","","","","","","","","","","","","","","","","","","","","","","","",""]
[null,null,null,null,"Resp Equipe 4",5234,{"$f":"IF($E$15=\"\",\"\",IF(VLOOKUP($E$15,$E$17:$NM$62,G$4,0)=0,\"\",VLOOKUP($E$15,$E$17:$NM$62,G$4,0)))","v":""},{"$f":"IF($E$15=\"\",\"\",IF(VLOOKUP($E$15,$E$17:$NM$62,H$4,0)=0,\"\",VLOOKUP($E$15,$E$17:$NM$62,H$4,0)))","v":""},"","","","","","","","","","","","","","","","","","","","","","","","","",""]
[null,null,null,null,null,"",{"$f":"IF($E$16=\"\",\"\",IF(VLOOKUP($E$16,$E$17:$NM$62,G$4,0)=0,\"\",VLOOKUP($E$16,$E$17:$NM$62,G$4,0)))","v":""},{"$f":"IF($E$16=\"\",\"\",IF(VLOOKUP($E$16,$E$17:$NM$62,H$4,0)=0,\"\",VLOOKUP($E$16,$E$17:$NM$62,H$4,0)))","v":""},"","","","","","","","","","","","","","","","","","","","","","","","","",""]
[null,null,null,"Conditionnement","Resp Equipe 1",3646]
[null,null,null,null,"Equipe 1_Tech 1",2837]
[null,null,null,null,"Equipe 1_Tech 2",2960,null,null,null,null,null,null,null,null,null,null,null,null,null,null,null,null,null,null,null,null,null,null,null,null,null,null,null,null,null,null,null,null,null,null,null,null,null,null,null,null,null,null,null,null,null,null,null,null,null,null,null,null,null,null,null,null,null,null,null,null,null,null,null,null,null,null,null,null,null,null,null,null,null,null,null,null,null,null,null,null,null,null,null,null,null,null,null,null,null,null,null,null,null,null,null,null,null,null,null,null,null,null,null,null,null,null,null,null,null,null,null,null,null,null,null,null,null,null,null,null,null,null,null,null,null,null,null,null,null,null,null,null,null,null,null,null,null,null,null,null,null,null,null,null,null,null,null,null,null,null,null,null,null,null,null,null,null,null,null,null,null,null,null,null,null,null,null,null,null,null,null,null,null,null,null,null,null,null,null,null,null,null,null,null,null,null,null,null,null,null,null,null,null,null,null,null,null,null,null,null,null,null,null,null,null,null,null,null,null,null,null,null,null,null,null,null,null,null,null,null,null,null,null,null,null,null,null,null,null,null,null,null,null,null,null,null,null,null,null,null,null,null,null,null,null,null,null,null,null,null,null,null,null,null,null,null,null,null,null,null,null,null,null,null,null,null,null,null,null,null,null,null,null,null,null,null,null,null,null,null,null,null,null,null,null,null,null,null,null,null,null,null,null,null,null,null,null,null,null,null,null,null,null,null,null,null,null,null,null,null,null,null,null,null,null,null,null,null,null,null,null,null,null,null,null,null,null,null,null,null,null,null,null,null,null,null,null,null,null,null,null,null,null,null,null,null,null,null,null,null,null,null,null,null,null,null,null,null,null,null,null,null,null,null,null,null,null,null,null,null,null,null,null,null,null,null,null,"N°","Jours","Code_jours","Colonne1"]
[null,null,null,null,"Equipe 1_Tech 3",2183,null,null,null,null,null,null,null,null,null,null,null,null,null,null,null,null,null,null,null,null,null,null,null,null,null,null,null,null,null,null,null,null,null,null,null,null,null,null,null,null,null,null,null,null,null,null,null,null,null,null,null,null,null,null,null,null,null,null,null,null,null,null,null,null,null,null,null,null,null,null,null,null,null,null,null,null,null,null,null,null,null,null,null,null,null,null,null,null,null,null,null,null,null,null,null,null,null,null,null,null,null,null,null,null,null,null,null,null,null,null,null,null,null,null,null,null,null,null,null,null,null,null,null,null,null,null,null,null,null,null,null,null,null,null,null,null,null,null,null,null,null,null,null,null,null,null,null,null,null,null,null,null,null,null,null,null,null,null,null,null,null,null,null,null,null,null,null,null,null,null,null,null,null,null,null,null,null,null,null,null,null,null,null,null,null,null,null,null,null,null,null,null,null,null,null,null,null,null,null,null,null,null,null,null,null,null,null,null,null,null,null,null,null,null,null,null,null,null,null,null,null,null,null,null,null,null,null,null,null,null,null,null,null,null,null,null,null,null,null,null,null,null,null,null,null,null,null,null,null,null,null,null,null,null,null,null,null,null,null,null,null,null,null,null,null,null,null,null,null,null,null,null,null,null,null,null,null,null,null,null,null,null,null,null,null,null,null,null,null,null,null,null,null,null,null,null,null,null,null,null,null,null,null,null,null,null,null,null,null,null,null,null,null,null,null,null,null,null,null,null,null,null,null,null,null,null,null,null,null,null,null,null,null,null,null,null,null,null,null,null,null,null,null,null,null,null,null,null,null,null,null,null,null,null,null,null,null,null,null,null,null,null,null,null,null,null,null,null,null,null,null,null,null,null,null,null,null,1,"Dimanche","D","Dimanche"]
[null,null,null,null,"Equipe 1_Tech 4",8341,null,null,null,null,null,null,null,null,null,null,null,null,null,null,null,null,null,null,null,null,null,null,null,null,null,null,null,null,null,null,null,null,null,null,null,null,null,null,null,null,null,null,null,null,null,null,null,null,null,null,null,null,null,null,null,null,null,null,null,null,null,null,null,null,null,null,null,null,null,null,null,null,null,null,null,null,null,null,null,null,null,null,null,null,null,null,null,null,null,null,null,null,null,null,null,null,null,null,null,null,null,null,null,null,null,null,null,null,null,null,null,null,null,null,null,null,null,null,null,null,null,null,null,null,null,null,null,null,null,null,null,null,null,null,null,null,null,null,null,null,null,null,null,null,null,null,null,null,null,null,null,null,null,null,null,null,null,null,null,null,null,null,null,null,null,null,null,null,null,null,null,null,null,null,null,null,null,null,null,null,null,null,null,null,null,null,null,null,null,null,null,null,null,null,null,null,null,null,null,null,null,null,null,null,null,null,null,null,null,null,null,null,null,null,null,null,null,null,null,null,null,null,null,null,null,null,null,null,null,null,null,null,null,null,null,null,null,null,null,null,null,null,null,null,null,null,null,null,null,null,null,null,null,null,null,null,null,null,null,null,null,null,null,null,null,null,null,null,null,null,null,null,null,null,null,null,null,null,null,null,null,null,null,null,null,null,null,null,null,null,null,null,null,null,null,null,null,null,null,null,null,null,null,null,null,null,null,null,null,null,null,null,null,null,null,null,null,null,null,null,null,null,null,null,null,null,null,null,null,null,null,null,null,null,null,null,null,null,null,null,null,null,null,null,null,null,null,null,null,null,null,null,null,null,null,null,null,null,null,null,null,null,null,null,null,null,null,null,null,null,null,null,null,null,null,null,null,2,"Lundi","L","Lundi"]
[null,null,null,null,"Equipe 1_Tech 5",1258,null,null,null,null,null,null,null,null,null,null,null,null,null,null,null,null,null,null,null,null,null,null,null,null,null,null,null,null,null,null,null,null,null,null,null,null,null,null,null,null,null,null,null,null,null,null,null,null,null,null,null,null,null,null,null,null,null,null,null,null,null,null,null,null,null,null,null,null,null,null,null,null,null,null,null,null,null,null,null,null,null,null,null,null,null,null,null,null,null,null,null,null,null,null,null,null,null,null,null,null,null,null,null,null,null,null,null,null,null,null,null,null,null,null,null,null,null,null,null,null,null,null,null,null,null,null,null,null,null,null,null,null,null,null,null,null,null,null,null,null,null,null,null,null,null,null,null,null,null,null,null,null,null,null,null,null,null,null,null,null,null,null,null,null,null,null,null,null,null,null,null,null,null,null,null,null,null,null,null,null,null,null,null,null,null,null,null,null,null,null,null,null,null,null,null,null,null,null,null,null,null,null,null,null,null,null,null,null,null,null,null,null,null,null,null,null,null,null,null,null,null,null,null,null,null,null,null,null,null,null,null,null,null,null,null,null,null,null,null,null,null,null,null,null,null,null,null,null,null,null,null,null,null,null,null,null,null,null,null,null,null,null,null,null,null,null,null,null,null,null,null,null,null,null,null,null,null,null,null,null,null,null,null,null,null,null,null,null,null,null,null,null,null,null,null,null,null,null,null,null,null,null,null,null,null,null,null,null,null,null,null,null,null,null,null,null,null,null,null,null,null,null,null,null,null,null,null,null,null,null,null,null,null,null,null,null,null,null,null,null,null,null,null,null,null,null,null,null,null,null,null,null,null,null,null,null,null,null,null,null,null,null,null,null,null,null,null,null,null,null,null,null,null,null,null,null,null,3,"Mardi","M","Mardi"]
[null,null,null,null,"Equipe 1_Tech 6",9734,null,null,null,null,null,null,null,null,null,null,null,null,null,null,null,null,null,null,null,null,null,null,null,null,null,null,null,null,null,null,null,null,null,null,null,null,null,null,null,null,null,null,null,null,null,null,null,null,null,null,null,null,null,null,null,null,null,null,null,null,null,null,null,null,null,null,null,null,null,null,null,null,null,null,null,null,null,null,null,null,null,null,null,null,null,null,null,null,null,null,null,null,null,null,null,null,null,null,null,null,null,null,null,null,null,null,null,null,null,null,null,null,null,null,null,null,null,null,null,null,null,null,null,null,null,null,null,null,null,null,null,null,null,null,null,null,null,null,null,null,null,null,null,null,null,null,null,null,null,null,null,null,null,null,null,null,null,null,null,null,null,null,null,null,null,null,null,null,null,null,null,null,null,null,null,null,null,null,null,null,null,null,null,null,null,null,null,null,null,null,null,null,null,null,null,null,null,null,null,null,null,null,null,null,null,null,null,null,null,null,null,null,null,null,null,null,null,null,null,null,null,null,null,null,null,null,null,null,null,null,null,null,null,null,null,null,null,null,null,null,null,null,null,null,null,null,null,null,null,null,null,null,null,null,null,null,null,null,null,null,null,null,null,null,null,null,null,null,null,null,null,null,null,null,null,null,null,null,null,null,null,null,null,null,null,null,null,null,null,null,null,null,null,null,null,null,null,null,null,null,null,null,null,null,null,null,null,null,null,null,null,null,null,null,null,null,null,null,null,null,null,null,null,null,null,null,null,null,null,null,null,null,null,null,null,null,null,null,null,null,null,null,null,null,null,null,null,null,null,null,null,null,null,null,null,null,null,null,null,null,null,null,null,null,null,null,null,null,null,null,null,null,null,null,null,null,null,4,"Mercredi","Me","Mercredi"]
[null,null,null,null,"Equipe 1_Tech 7",3986,null,null,null,null,null,null,null,null,null,null,null,null,null,null,null,null,null,null,null,null,null,null,null,null,null,null,null,null,null,null,null,null,null,null,null,null,null,null,null,null,null,null,null,null,null,null,null,null,null,null,null,null,null,null,null,null,null,null,null,null,null,null,null,null,null,null,null,null,null,null,null,null,null,null,null,null,null,null,null,null,null,null,null,null,null,null,null,null,null,null,null,null,null,null,null,null,null,null,null,null,null,null,null,null,null,null,null,null,null,null,null,null,null,null,null,null,null,null,null,null,null,null,null,null,null,null,null,null,null,null,null,null,null,null,null,null,null,null,null,null,null,null,null,null,null,null,null,null,null,null,null,null,null,null,null,null,null,null,null,null,null,null,null,null,null,null,null,null,null,null,null,null,null,null,null,null,null,null,null,null,null,null,null,null,null,null,null,null,null,null,null,null,null,null,null,null,null,null,null,null,null,null,null,null,null,null,null,null,null,null,null,null,null,null,null,null,null,null,null,null,null,null,null,null,null,null,null,null,null,null,null,null,null,null,null,null,null,null,null,null,null,null,null,null,null,null,null,null,null,null,null,null,null,null,null,null,null,null,null,null,null,null,null,null,null,null,null,null,null,null,null,null,null,null,null,null,null,null,null,null,null,null,null,null,null,null,null,null,null,null,null,null,null,null,null,null,null,null,null,null,null,null,null,null,null,null,null,null,null,null,null,null,null,null,null,null,null,null,null,null,null,null,null,null,null,null,null,null,null,null,null,null,null,null,null,null,null,null,null,null,null,null,null,null,null,null,null,null,null,null,null,null,null,null,null,null,null,null,null,null,null,null,null,null,null,null,null,null,null,null,null,null,null,null,null,null,null,5,"Jeudi","J","Jeudi"]
[null,null,null,null,"Equipe 1_Tech 8",6476,null,null,null,null,null,null,null,null,null,null,null,null,null,null,null,null,null,null,null,null,null,null,null,null,null,null,null,null,null,null,null,null,null,null,null,null,null,null,null,null,null,null,null,null,null,null,null,null,null,null,null,null,null,null,null,null,null,null,null,null,null,null,null,null,null,null,null,null,null,null,null,null,null,null,null,null,null,null,null,null,null,null,null,null,null,null,null,null,null,null,null,null,null,null,null,null,null,null,null,null,null,null,null,null,null,null,null,null,null,null,null,null,null,null,null,null,null,null,null,null,null,null,null,null,null,null,null,null,null,null,null,null,null,null,null,null,null,null,null,null,null,null,null,null,null,null,null,null,null,null,null,null,null,null,null,null,null,null,null,null,null,null,null,null,null,null,null,null,null,null,null,null,null,null,null,null,null,null,null,null,null,null,null,null,null,null,null,null,null,null,null,null,null,null,null,null,null,null,null,null,null,null,null,null,null,null,null,null,null,null,null,null,null,null,null,null,null,null,null,null,null,null,null,null,null,null,null,null,null,null,null,null,null,null,null,null,null,null,null,null,null,null,null,null,null,null,null,null,null,null,null,null,null,null,null,null,null,null,null,null,null,null,null,null,null,null,null,null,null,null,null,null,null,null,null,null,null,null,null,null,null,null,null,null,null,null,null,null,null,null,null,null,null,null,null,null,null,null,null,null,null,null,null,null,null,null,null,null,null,null,null,null,null,null,null,null,null,null,null,null,null,null,null,null,null,null,null,null,null,null,null,null,null,null,null,null,null,null,null,null,null,null,null,null,null,null,null,null,null,null,null,null,null,null,null,null,null,null,null,null,null,null,null,null,null,null,null,null,null,null,null,null,null,null,null,null,null,6,"Vendredi","V","Vendredi"]
[null,null,null,null,"Equipe 1_Tech 9",2844,null,null,null,null,null,null,null,null,null,null,null,null,null,null,null,null,null,null,null,null,null,null,null,null,null,null,null,null,null,null,null,null,null,null,null,null,null,null,null,null,null,null,null,null,null,null,null,null,null,null,null,null,null,null,null,null,null,null,null,null,null,null,null,null,null,null,null,null,null,null,null,null,null,null,null,null,null,null,null,null,null,null,null,null,null,null,null,null,null,null,null,null,null,null,null,null,null,null,null,null,null,null,null,null,null,null,null,null,null,null,null,null,null,null,null,null,null,null,null,null,null,null,null,null,null,null,null,null,null,null,null,null,null,null,null,null,null,null,null,null,null,null,null,null,null,null,null,null,null,null,null,null,null,null,null,null,null,null,null,null,null,null,null,null,null,null,null,null,null,null,null,null,null,null,null,null,null,null,null,null,null,null,null,null,null,null,null,null,null,null,null,null,null,null,null,null,null,null,null,null,null,null,null,null,null,null,null,null,null,null,null,null,null,null,null,null,null,null,null,null,null,null,null,null,null,null,null,null,null,null,null,null,null,null,null,null,null,null,null,null,null,null,null,null,null,null,null,null,null,null,null,null,null,null,null,null,null,null,null,null,null,null,null,null,null,null,null,null,null,null,null,null,null,null,null,null,null,null,null,null,null,null,null,null,null,null,null,null,null,null,null,null,null,null,null,null,null,null,null,null,null,null,null,null,null,null,null,null,null,null,null,null,null,null,null,null,null,null,null,null,null,null,null,null,null,null,null,null,null,null,null,null,null,null,null,null,null,null,null,null,null,null,null,null,null,null,null,null,null,null,null,null,null,null,null,null,null,null,null,null,null,null,null,null,null,null,null,null,null,null,null,null,null,null,null,null,null,7,"Samedi","S","Samedi"]
[null,null,null,null,"Equipe 1_Tech 10",3985]
[null,null,null,null,"Equipe 1_Tech 11",3984]
[null,null,null,null,"Equipe 1_Tech 12",9878]
[]
[]
[null,null,null,"Abattoir","Resp Equipe 2",5390]
[null,null,null,null,"Equipe 2_Tech 1",2908]
[null,null,null,null,"Equipe 2_Tech 2",3553]
[null,null,null,null,"Equipe 2_Tech 3",3737]
[null,null,null,null,"Equipe 2_Tech 4",3546]
[null,null,null,null,"Equipe 2_Tech 5",6742]
[null,null,null,null,"Equipe 2_Tech 6",1136]
[null,null,null,null,"Equipe 2_Tech 7",1410]
[null,null,null,null,"Equipe 2_Tech 8",7202]
[null,null,null,null,"Equipe 2_Tech 9",5885]
[null,null,null,null,"Equipe 2_Tech 10",9353]
[null,null,null,null,"Equipe 2_Tech 11",6746]
[null,null,null,null,"Equipe 2_Tech 12",9600]
[]
[]
[null,null,null,"Energie","Resp Equipe 3",9329]
[null,null,null,null,"Equipe 3_Tech 1",7754]
[null,null,null,null,"Equipe 3_Tech 2",3658]
[null,null,null,null,"Equipe 3_Tech 3",8314]
[]
[]
[]
[]
[null,null,null,"Magasin","Resp Equipe 4",5234]
[null,null,null,null,"Equipe 4_Tech 1",8638]
[null,null,null,null,"Equipe 4_Tech 2",3575]
[null,null,null,null,"Equipe 4_Tech 3",6793]
[null,null,null,null,"Equipe 4_Tech 4",6647]
[]
[]
[null,null,null,null," "]

{"sheet":"Conditionnement","index":2,"n_rows":93,"n_cols":53,"rows_kept":93,"cut":false,"hidden":false,"merged":[[19,1,21,2],[19,3,21,4],[21,6,21,8],[87,13,87,15],[88,13,88,15],[89,13,89,15],[90,13,90,15],[30,4,30,9],[31,4,31,9],[32,4,32,9],[33,4,33,9],[34,4,34,9],[35,4,35,9],[33,14,33,15],[34,14,34,15],[23,1,28,2],[30,1,35,2],[24,6,24,8],[25,6,25,8],[26,6,26,8],[25,3,26,4],[23,3,24,4],[55,14,55,15],[56,14,56,15],[20,5,21,5],[78,16,80,16],[86,13,86,15],[8,6,8,8],[15,6,15,8],[14,6,14,8],[13,6,13,8],[16,3,18,4],[32,14,32,15],[74,14,74,15],[64,14,64,15],[27,3,28,4],[23,6,23,8],[27,6,27,8],[28,6,28,8],[20,6,20,8],[50,14,50,15],[51,14,51,15],[12,6,12,8],[54,14,54,15],[36,14,36,15],[37,14,37,15],[38,14,38,15],[8,5,9,5],[83,13,83,15],[84,13,84,15],[85,13,85,15],[2,32,7,32],[2,33,7,33],[32,16,34,16],[2,28,7,28],[2,19,7,19],[2,20,7,20],[2,21,7,21],[2,22,7,22],[2,23,7,23],[2,24,7,24],[2,25,7,25],[2,26,7,26],[2,27,7,27],[2,29,7,29],[2,30,7,30],[2,31,7,31],[78,14,78,15],[79,14,79,15],[80,14,80,15],[74,16,76,16],[75,14,75,15],[2,1,2,2],[2,3,2,5],[2,6,2,8],[3,1,3,9],[4,1,6,2],[4,6,4,8],[5,6,5,8],[6,6,6,8],[4,3,6,4],[4,5,6,5],[16,1,18,2],[7,6,7,8],[9,6,9,8],[10,6,10,8],[11,6,11,8],[10,3,12,4],[13,1,15,2],[16,6,16,8],[18,6,18,8],[7,1,9,2],[10,1,12,2],[17,5,18,5],[17,6,17,8],[13,3,15,4],[11,5,12,5],[14,5,15,5],[7,3,9,4],[76,14,76,15],[19,6,19,8],[64,16,66,16],[65,14,65,15],[66,14,66,15],[69,14,69,15],[69,16,71,16],[70,14,70,15],[71,14,71,15],[30,14,31,15],[59,14,59,15],[59,16,61,16],[60,14,60,15],[61,14,61,15],[49,16,51,16],[49,14,49,15],[54,16,56,16],[36,16,38,16]]}
[]
[null,{"$f":"CONCATENATE(\"Du \",N11,\"/\",O11,\"/\",P11,\" au \",N12,\"/\",O12,\"/\",P12)","v":"Du 30/9/2019 au 6/10/2019"},null,null,null,null,null,null,"Semaine :",39,{"$f":"Planning_général!C2","v":2019}]
[null,"Équipes",null,"Horaires",null,null,"Nom et Prénom",null,null,"Matricul",null,null,null,null,null,null,null,null,null,{"$f":"Planning_général!E17","v":"Resp Equipe 1"},{"$f":"Planning_général!E18","v":"Equipe 1_Tech 1"},{"$f":"Planning_général!E19","v":"Equipe 1_Tech 2"},{"$f":"Planning_général!E20","v":"Equipe 1_Tech 3"},{"$f":"Planning_général!E21","v":"Equipe 1_Tech 4"},{"$f":"Planning_général!E22","v":"Equipe 1_Tech 5"},{"$f":"Planning_général!E23","v":"Equipe 1_Tech 6"},{"$f":"Planning_général!E24","v":"Equipe 1_Tech 7"},{"$f":"Planning_général!E25","v":"Equipe 1_Tech 8"},{"$f":"Planning_général!E26","v":"Equipe 1_Tech 9"},{"$f":"Planning_général!E27","v":"Equipe 1_Tech 10"},{"$f":"Planning_général!E28","v":"Equipe 1_Tech 11"},{"$f":"Planning_général!E29","v":"Equipe 1_Tech 12"},{"$f":"Planning_général!E30","v":0},{"$f":"Planning_général!E31","v":0}]
[]
[null,"JOURNEE",null,"8h - 12h / 13h - 16h",null,null,{"$f":"IF(O33=\"\",\"\",O33)","v":""},null,null,{"$f":"IF(G5=\"\",\"\",IF(VLOOKUP(G5,Planning_général!$E$17:$F$62,2,0)=0,\"\",VLOOKUP(G5,Planning_général!$E$17:$F$62,2,0)))","v":""},null,null,"Initial",{"$f":"DATE(K2,1,1)","v":"2019-01-01"},{"$f":"N5","v":43466}]
[null,null,null,null,null,null,{"$f":"IF(O34=\"\",\"\",O34)","v":""},null,null,{"$f":"IF(G6=\"\",\"\",IF(VLOOKUP(G6,Planning_général!$E$17:$F$62,2,0)=0,\"\",VLOOKUP(G6,Planning_général!$E$17:$F$62,2,0)))","v":""},null,null,"Du",{"$f":"(O5)+($J$2)*7-WEEKDAY(N5,2)+1","v":"2019-09-30"},null,null,null,null,null,null,null,null,null,null,null,null,null,null,null,null,null,null,null,null,null,null,null,null,null,null,null,null,null,null,null,null,null,null,null,null,null,null,"Semaines"]
[null,null,null,null,null,null,"",null,null,{"$f":"IF(G7=\"\",\"\",IF(VLOOKUP(G7,Planning_général!$E$17:$F$62,2,0)=0,\"\",VLOOKUP(G7,Planning_général!$E$17:$F$62,2,0)))","v":""},null,null,"Au",{"$f":"N6+6","v":"2019-10-06"},null,null,null,null,null,null,null,null,null,null,null,null,null,null,null,null,null,null,null,null,null,null,null,null,null,null,null,null,null,null,null,null,null,null,null,null,null,null,1]
[null,"DEMARRAGE",null,"4 h 30 - 11 h 30",null,"Pause",{"$f":"IF(O79=\"\",\"\",O79)","v":""},null,null,{"$f":"IF(G8=\"\",\"\",IF(VLOOKUP(G8,Planning_général!$E$17:$F$62,2,0)=0,\"\",VLOOKUP(G8,Planning_général!$E$17:$F$62,2,0)))","v":""},null,null,null,null,null,null,null,null,null,null,null,null,null,null,null,null,null,null,null,null,null,null,null,null,null,null,null,null,null,null,null,null,"Code",null,null,null,null,null,null,null,null,null,2]
[null,null,null,null,null,{"$f":"VLOOKUP(D11,$AN$10:$AO$17,2,0)","v":"9 h 20 - 9 h 40"},{"$f":"IF(O80=\"\",\"\",O80)","v":""},null,null,{"$f":"IF(G9=\"\",\"\",IF(VLOOKUP(G9,Planning_général!$E$17:$F$62,2,0)=0,\"\",VLOOKUP(G9,Planning_général!$E$17:$F$62,2,0)))","v":""},null,null,null,null,null,null,null,null,"Code",{"$f":"IF(VLOOKUP(T3,Planning_général!$E$17:$F$62,2,0)=0,\"Cde abs\",VLOOKUP(T3,Planning_général!$E$17:$F$62,2,0))","v":3646},{"$f":"IF(VLOOKUP(U3,Planning_général!$E$17:$F$62,2,0)=0,\"Cde abs\",VLOOKUP(U3,Planning_général!$E$17:$F$62,2,0))","v":2837},{"$f":"IF(VLOOKUP(V3,Planning_général!$E$17:$F$62,2,0)=0,\"Cde abs\",VLOOKUP(V3,Planning_général!$E$17:$F$62,2,0))","v":2960},{"$f":"IF(VLOOKUP(W3,Planning_général!$E$17:$F$62,2,0)=0,\"Cde abs\",VLOOKUP(W3,Planning_général!$E$17:$F$62,2,0))","v":2183},{"$f":"IF(VLOOKUP(X3,Planning_général!$E$17:$F$62,2,0)=0,\"Cde abs\",VLOOKUP(X3,Planning_général!$E$17:$F$62,2,0))","v":8341},{"$f":"IF(VLOOKUP(Y3,Planning_général!$E$17:$F$62,2,0)=0,\"Cde abs\",VLOOKUP(Y3,Planning_général!$E$17:$F$62,2,0))","v":1258},{"$f":"IF(VLOOKUP(Z3,Planning_général!$E$17:$F$62,2,0)=0,\"Cde abs\",VLOOKUP(Z3,Planning_général!$E$17:$F$62,2,0))","v":9734},{"$f":"IF(VLOOKUP(AA3,Planning_général!$E$17:$F$62,2,0)=0,\"Cde abs\",VLOOKUP(AA3,Planning_général!$E$17:$F$62,2,0))","v":3986},{"$f":"IF(VLOOKUP(AB3,Planning_général!$E$17:$F$62,2,0)=0,\"Cde abs\",VLOOKUP(AB3,Planning_général!$E$17:$F$62,2,0))","v":6476},{"$f":"IF(VLOOKUP(AC3,Planning_général!$E$17:$F$62,2,0)=0,\"Cde abs\",VLOOKUP(AC3,Planning_général!$E$17:$F$62,2,0))","v":2844},{"$f":"IF(VLOOKUP(AD3,Planning_général!$E$17:$F$62,2,0)=0,\"Cde abs\",VLOOKUP(AD3,Planning_général!$E$17:$F$62,2,0))","v":3985},{"$f":"IF(VLOOKUP(AE3,Planning_général!$E$17:$F$62,2,0)=0,\"Cde abs\",VLOOKUP(AE3,Planning_général!$E$17:$F$62,2,0))","v":3984},{"$f":"IF(VLOOKUP(AF3,Planning_général!$E$17:$F$62,2,0)=0,\"Cde abs\",VLOOKUP(AF3,Planning_général!$E$17:$F$62,2,0))","v":9878},{"$f":"IF(VLOOKUP(AG3,Planning_général!$E$17:$F$62,2,0)=0,\"Cde abs\",VLOOKUP(AG3,Planning_général!$E$17:$F$62,2,0))","v":{"$error":"#N/A"}},{"$f":"IF(AH3=0,\"\",IF(VLOOKUP(AH3,Planning_général!$E$17:$F$62,2,0)=0,\"Cde abs\",VLOOKUP(AH3,Planning_général!$E$17:$F$62,2,0)))","v":""},null,null,null,"Code","Descriptif","Horaires","Pause",null,"CP",null,null,null,null,null,null,null,null,null,3]
[null,null,null,null,null,null,"",null,null,{"$f":"IF(G10=\"\",\"\",IF(VLOOKUP(G10,Planning_général!$E$17:$F$62,2,0)=0,\"\",VLOOKUP(G10,Planning_général!$E$17:$F$62,2,0)))","v":""},null,null,null,null,null,null,null,{"$f":"Planning_général!G10","v":"M"},{"$f":"VLOOKUP(R10,Planning_général!$NV$20:$NW$26,2,0)","v":"Mardi"},{"$f":"VLOOKUP(T3,Planning_général!$E$17:$NM$17,((($J$2*7)+2)-6),0)","v":0},{"$f":"IF(ISNA(VLOOKUP(U3,Planning_général!$E$18:$NM$18,((($J$2*7)+2)-6),0)),0,VLOOKUP(U3,Planning_général!$E$18:$NM$18,((($J$2*7)+2)-6),0))","v":0},{"$f":"VLOOKUP(V3,Planning_général!$E$19:$NM$19,((($J$2*7)+2)-6),0)","v":0},{"$f":"VLOOKUP(W3,Planning_général!$E$20:$NM$20,((($J$2*7)+2)-6),0)","v":0},{"$f":"VLOOKUP(X3,Planning_général!$E$21:$NM$21,((($J$2*7)+2)-6),0)","v":0},{"$f":"VLOOKUP(Y3,Planning_général!$E$22:$NM$22,((($J$2*7)+2)-6),0)","v":0},{"$f":"VLOOKUP($Z$3,Planning_général!$E$23:$NM$23,((($J$2*7)+2)-6),0)","v":0},{"$f":"VLOOKUP($AA$3,Planning_général!$E$24:$NM$24,((($J$2*7)+2)-6),0)","v":0},{"$f":"VLOOKUP($AB$3,Planning_général!$E$25:$NM$25,((($J$2*7)+2)-6),0)","v":0},{"$f":"VLOOKUP($AC$3,Planning_général!$E$26:$NM$26,((($J$2*7)+2)-6),0)","v":0},{"$f":"VLOOKUP($AD$3,Planning_général!$E$27:$NM$27,((($J$2*7)+2)-6),0)","v":0},{"$f":"VLOOKUP($AE$3,Planning_général!$E$28:$NM$28,((($J$2*7)+2)-6),0)","v":0},{"$f":"VLOOKUP($AF$3,Planning_général!$E$29:$NM$29,((($J$2*7)+2)-6),0)","v":0},{"$f":"VLOOKUP($AG$3,Planning_général!$E$30:$NM$30,((($J$2*7)+2)-6),0)","v":{"$error":"#N/A"}},{"$f":"IF(ISNA(VLOOKUP($AH$3,Planning_général!$E$31:$NM$31,((($J$2*7)+2)-6),0)),0,VLOOKUP($AH$3,Planning_général!$E$31:$NM$31,((($J$2*7)+2)-6),0))","v":0},null,null,null,"AM1","SAMEDI 1","4 h 30 - 11 h 30 ","9 h - 9 h 20",null,"Recup",null,null,null,null,null,null,null,null,null,4]
[null,"MATIN",null,"5 h 30 - 12 h 30 ",null,"Pause",{"$f":"IF(O60=\"\",\"\",O60)","v":""},null,null,{"$f":"IF(G11=\"\",\"\",IF(VLOOKUP(G11,Planning_général!$E$17:$F$62,2,0)=0,\"\",VLOOKUP(G11,Planning_général!$E$17:$F$62,2,0)))","v":""},null,null,{"$f":"N6","v":"2019-09-30"},{"$f":"DAY(M11)","v":30},{"$f":"MONTH(M11)","v":9},{"$f":"YEAR(M11)","v":2019},null,{"$f":"Planning_général!H10","v":"Me"},{"$f":"VLOOKUP(R11,Planning_général!$NV$20:$NW$26,2,0)","v":"Mercredi"},{"$f":"VLOOKUP($T$3,Planning_général!$E$17:$NM$17,((($J$2*7)+2)-5),0)","v":0},{"$f":"VLOOKUP($U$3,Planning_général!$E$18:$NM$18,((($J$2*7)+2)-5),0)","v":0},{"$f":"VLOOKUP($V$3,Planning_général!$E$19:$NM$19,((($J$2*7)+2)-5),0)","v":0},{"$f":"VLOOKUP($W$3,Planning_général!$E$20:$NM$20,((($J$2*7)+2)-5),0)","v":0},{"$f":"VLOOKUP($X$3,Planning_général!$E$21:$NM$21,((($J$2*7)+2)-5),0)","v":0},{"$f":"VLOOKUP($Y$3,Planning_général!$E$22:$NM$22,((($J$2*7)+2)-5),0)","v":0},{"$f":"VLOOKUP($Z$3,Planning_général!$E$23:$NM$23,((($J$2*7)+2)-5),0)","v":0},{"$f":"VLOOKUP($AA$3,Planning_général!$E$24:$NM$24,((($J$2*7)+2)-5),0)","v":0},{"$f":"VLOOKUP($AB$3,Planning_général!$E$25:$NM$25,((($J$2*7)+2)-5),0)","v":0},{"$f":"VLOOKUP($AC$3,Planning_général!$E$26:$NM$26,((($J$2*7)+2)-5),0)","v":0},{"$f":"VLOOKUP($AD$3,Planning_général!$E$27:$NM$27,((($J$2*7)+2)-5),0)","v":0},{"$f":"VLOOKUP($AE$3,Planning_général!$E$28:$NM$28,((($J$2*7)+2)-5),0)","v":0},{"$f":"VLOOKUP($AF$3,Planning_général!$E$29:$NM$29,((($J$2*7)+2)-5),0)","v":0},{"$f":"VLOOKUP($AG$3,Planning_général!$E$30:$NM$30,((($J$2*7)+2)-5),0)","v":{"$error":"#N/A"}},{"$f":"IF(ISNA(VLOOKUP($AH$3,Planning_général!$E$31:$NM$31,((($J$2*7)+2)-5),0)),0,VLOOKUP($AH$3,Planning_général!$E$31:$NM$31,((($J$2*7)+2)-5),0))","v":0},null,null,null,"M","Matin","5 h 30 - 12 h 30 ","9 h 20 - 9 h 40",null,"Form",null,null,null,null,null,null,null,null,null,5]
[null,null,null,null,null,{"$f":"VLOOKUP(D11,$AN$10:$AO$17,2,0)","v":"9 h 20 - 9 h 40"},{"$f":"IF(O61=\"\",\"\",O61)","v":""},null,null,{"$f":"IF(G12=\"\",\"\",IF(VLOOKUP(G12,Planning_général!$E$17:$F$62,2,0)=0,\"\",VLOOKUP(G12,Planning_général!$E$17:$F$62,2,0)))","v":""},null,null,{"$f":"N7","v":"2019-10-06"},{"$f":"DAY(M12)","v":6},{"$f":"MONTH(M12)","v":10},{"$f":"YEAR(M12)","v":2019},null,{"$f":"Planning_général!I10","v":"J"},{"$f":"VLOOKUP(R12,Planning_général!$NV$20:$NW$26,2,0)","v":"Jeudi"},{"$f":"VLOOKUP($T$3,Planning_général!$E$17:$NM$17,((($J$2*7)+2)-4),0)","v":0},{"$f":"VLOOKUP($U$3,Planning_général!$E$18:$NM$18,((($J$2*7)+2)-4),0)","v":0},{"$f":"VLOOKUP($V$3,Planning_général!$E$19:$NM$19,((($J$2*7)+2)-4),0)","v":0},{"$f":"VLOOKUP($W$3,Planning_général!$E$20:$NM$20,((($J$2*7)+2)-4),0)","v":0},{"$f":"VLOOKUP($X$3,Planning_général!$E$21:$NM$21,((($J$2*7)+2)-4),0)","v":0},{"$f":"VLOOKUP($Y$3,Planning_général!$E$22:$NM$22,((($J$2*7)+2)-4),0)","v":0},{"$f":"VLOOKUP($Z$3,Planning_général!$E$23:$NM$23,((($J$2*7)+2)-4),0)","v":0},{"$f":"VLOOKUP($AA$3,Planning_général!$E$24:$NM$24,((($J$2*7)+2)-4),0)","v":0},{"$f":"VLOOKUP($AB$3,Planning_général!$E$25:$NM$25,((($J$2*7)+2)-4),0)","v":0},{"$f":"VLOOKUP($AC$3,Planning_général!$E$26:$NM$26,((($J$2*7)+2)-4),0)","v":0},{"$f":"VLOOKUP($AD$3,Planning_général!$E$27:$NM$27,((($J$2*7)+2)-4),0)","v":0},{"$f":"VLOOKUP($AE$3,Planning_général!$E$28:$NM$28,((($J$2*7)+2)-4),0)","v":0},{"$f":"VLOOKUP($AF$3,Planning_général!$E$29:$NM$29,((($J$2*7)+2)-4),0)","v":0},{"$f":"VLOOKUP($AG$3,Planning_général!$E$30:$NM$30,((($J$2*7)+2)-4),0)","v":{"$error":"#N/A"}},{"$f":"IF(ISNA(VLOOKUP($AH$3,Planning_général!$E$31:$NM$31,((($J$2*7)+2)-4),0)),0,VLOOKUP($AH$3,Planning_général!$E$31:$NM$31,((($J$2*7)+2)-4),0))","v":0},null,null,null,"AM2","SAMEDI 2","6 h 00 - 13 h 00 ","9 h 20 - 9 h 40",null,"Modul",null,null,null,null,null,null,null,null,null,6]
[null,null,null,null,null,null,"",null,null,{"$f":"IF(G13=\"\",\"\",IF(VLOOKUP(G13,Planning_général!$E$17:$F$62,2,0)=0,\"\",VLOOKUP(G13,Planning_général!$E$17:$F$62,2,0)))","v":""},null,null,null,null,null,null,null,{"$f":"Planning_général!J10","v":"V"},{"$f":"VLOOKUP(R13,Planning_général!$NV$20:$NW$26,2,0)","v":"Vendredi"},{"$f":"VLOOKUP($T$3,Planning_général!$E$17:$NM$17,((($J$2*7)+2)-3),0)","v":0},{"$f":"VLOOKUP($U$3,Planning_général!$E$18:$NM$18,((($J$2*7)+2)-3),0)","v":0},{"$f":"VLOOKUP($V$3,Planning_général!$E$19:$NM$19,((($J$2*7)+2)-3),0)","v":0},{"$f":"VLOOKUP($W$3,Planning_général!$E$20:$NM$20,((($J$2*7)+2)-3),0)","v":0},{"$f":"VLOOKUP($X$3,Planning_général!$E$21:$NM$21,((($J$2*7)+2)-3),0)","v":0},{"$f":"VLOOKUP($Y$3,Planning_général!$E$22:$NM$22,((($J$2*7)+2)-3),0)","v":0},{"$f":"VLOOKUP($Z$3,Planning_général!$E$23:$NM$23,((($J$2*7)+2)-3),0)","v":0},{"$f":"VLOOKUP($AA$3,Planning_général!$E$24:$NM$24,((($J$2*7)+2)-3),0)","v":0},{"$f":"VLOOKUP($AB$3,Planning_général!$E$25:$NM$25,((($J$2*7)+2)-3),0)","v":0},{"$f":"VLOOKUP($AC$3,Planning_général!$E$26:$NM$26,((($J$2*7)+2)-3),0)","v":0},{"$f":"VLOOKUP($AD$3,Planning_général!$E$27:$NM$27,((($J$2*7)+2)-3),0)","v":0},{"$f":"VLOOKUP($AE$3,Planning_général!$E$28:$NM$28,((($J$2*7)+2)-3),0)","v":0},{"$f":"VLOOKUP($AF$3,Planning_général!$E$29:$NM$29,((($J$2*7)+2)-3),0)","v":0},{"$f":"VLOOKUP($AG$3,Planning_général!$E$30:$NM$30,((($J$2*7)+2)-3),0)","v":{"$error":"#N/A"}},{"$f":"IF(ISNA(VLOOKUP($AH$3,Planning_général!$E$31:$NM$31,((($J$2*7)+2)-3),0)),0,VLOOKUP($AH$3,Planning_général!$E$31:$NM$31,((($J$2*7)+2)-3),0))","v":0},null,null,null,"J","Journee","7 h 30 - 12 h 30 / 13 h30 - 17 h 30","10 h 20 - 9 h 40",null,"H.R",null,null,null,null,null,null,null,null,null,7]
[null,"APRÈS-MIDI",null,"12 h 00 - 19 h 00 ",null,"Pause",{"$f":"IF(O65=\"\",\"\",O65)","v":""},null,null,{"$f":"IF(G14=\"\",\"\",IF(VLOOKUP(G14,Planning_général!$E$17:$F$62,2,0)=0,\"\",VLOOKUP(G14,Planning_général!$E$17:$F$62,2,0)))","v":""},null,null,null,null,null,null,null,{"$f":"Planning_général!K10","v":"S"},{"$f":"VLOOKUP(R14,Planning_général!$NV$20:$NW$26,2,0)","v":"Samedi"},{"$f":"VLOOKUP($T$3,Planning_général!$E$17:$NM$17,((($J$2*7)+2)-2),0)","v":0},{"$f":"VLOOKUP($U$3,Planning_général!$E$18:$NM$18,((($J$2*7)+2)-2),0)","v":0},{"$f":"VLOOKUP($V$3,Planning_général!$E$19:$NM$19,((($J$2*7)+2)-2),0)","v":0},{"$f":"VLOOKUP($W$3,Planning_général!$E$20:$NM$20,((($J$2*7)+2)-2),0)","v":0},{"$f":"VLOOKUP($X$3,Planning_général!$E$21:$NM$21,((($J$2*7)+2)-2),0)","v":0},{"$f":"VLOOKUP($Y$3,Planning_général!$E$22:$NM$22,((($J$2*7)+2)-2),0)","v":0},{"$f":"VLOOKUP($Z$3,Planning_général!$E$23:$NM$23,((($J$2*7)+2)-2),0)","v":0},{"$f":"VLOOKUP($AA$3,Planning_général!$E$24:$NM$24,((($J$2*7)+2)-2),0)","v":0},{"$f":"VLOOKUP($AB$3,Planning_général!$E$25:$NM$25,((($J$2*7)+2)-2),0)","v":0},{"$f":"VLOOKUP($AC$3,Planning_général!$E$26:$NM$26,((($J$2*7)+2)-2),0)","v":0},{"$f":"VLOOKUP($AD$3,Planning_général!$E$27:$NM$27,((($J$2*7)+2)-2),0)","v":0},{"$f":"VLOOKUP($AE$3,Planning_général!$E$28:$NM$28,((($J$2*7)+2)-2),0)","v":0},{"$f":"VLOOKUP($AF$3,Planning_général!$E$29:$NM$29,((($J$2*7)+2)-2),0)","v":0},{"$f":"VLOOKUP($AG$3,Planning_général!$E$30:$NM$30,((($J$2*7)+2)-2),0)","v":{"$error":"#N/A"}},{"$f":"IF(ISNA(VLOOKUP($AH$3,Planning_général!$E$31:$NM$31,((($J$2*7)+2)-2),0)),0,VLOOKUP($AH$3,Planning_général!$E$31:$NM$31,((($J$2*7)+2)-2),0))","v":0},null,null,null,"AM3","Samedi 3","7 h 00 - 14 h 00 ","9 h 40 - 10 h 00",null,"HR Nuit",null,null,null,null,null,null,null,null,null,8]
[null,null,null,null,null,{"$f":"VLOOKUP(D14,$AN$10:$AO$17,2,0)","v":"15H30 - 15H50"},{"$f":"IF(O66=\"\",\"\",O66)","v":""},null,null,{"$f":"IF(G15=\"\",\"\",IF(VLOOKUP(G15,Planning_général!$E$17:$F$62,2,0)=0,\"\",VLOOKUP(G15,Planning_général!$E$17:$F$62,2,0)))","v":""},null,null,null,null,null,null,null,{"$f":"Planning_général!L10","v":"D"},{"$f":"VLOOKUP(R15,Planning_général!$NV$20:$NW$26,2,0)","v":"Dimanche"},{"$f":"VLOOKUP($T$3,Planning_général!$E$17:$NM$17,((($J$2*7)+2)-1),0)","v":0},{"$f":"VLOOKUP($U$3,Planning_général!$E$18:$NM$18,((($J$2*7)+2)-1),0)","v":0},{"$f":"VLOOKUP($V$3,Planning_général!$E$19:$NM$19,((($J$2*7)+2)-1),0)","v":0},{"$f":"VLOOKUP($W$3,Planning_général!$E$20:$NM$20,((($J$2*7)+2)-1),0)","v":0},{"$f":"VLOOKUP($X$3,Planning_général!$E$21:$NM$21,((($J$2*7)+2)-1),0)","v":0},{"$f":"VLOOKUP($Y$3,Planning_général!$E$22:$NM$22,((($J$2*7)+2)-1),0)","v":0},{"$f":"VLOOKUP($Z$3,Planning_général!$E$23:$NM$23,((($J$2*7)+2)-1),0)","v":0},{"$f":"VLOOKUP($AA$3,Planning_général!$E$24:$NM$24,((($J$2*7)+2)-1),0)","v":0},{"$f":"VLOOKUP($AB$3,Planning_général!$E$25:$NM$25,((($J$2*7)+2)-1),0)","v":0},{"$f":"VLOOKUP($AC$3,Planning_général!$E$26:$NM$26,((($J$2*7)+2)-1),0)","v":0},{"$f":"VLOOKUP($AD$3,Planning_général!$E$27:$NM$27,((($J$2*7)+2)-1),0)","v":0},{"$f":"VLOOKUP($AE$3,Planning_général!$E$28:$NM$28,((($J$2*7)+2)-1),0)","v":0},{"$f":"VLOOKUP($AF$3,Planning_général!$E$29:$NM$29,((($J$2*7)+2)-1),0)","v":0},{"$f":"VLOOKUP($AG$3,Planning_général!$E$30:$NM$30,((($J$2*7)+2)-1),0)","v":{"$error":"#N/A"}},{"$f":"IF(ISNA(VLOOKUP($AH$3,Planning_général!$E$31:$NM$31,((($J$2*7)+2)-1),0)),0,VLOOKUP($AH$3,Planning_général!$E$31:$NM$31,((($J$2*7)+2)-1),0))","v":0},null,null,null,"AP","Après-midi","12 h 00 - 19 h 00 ","15H30 - 15H50",null,"RTT",null,null,null,null,null,null,null,null,null,9]
[null,null,null,null,null,null,"",null,null,{"$f":"IF(G16=\"\",\"\",IF(VLOOKUP(G16,Planning_général!$E$17:$F$62,2,0)=0,\"\",VLOOKUP(G16,Planning_général!$E$17:$F$62,2,0)))","v":""},null,null,null,null,null,null,null,{"$f":"Planning_général!M10","v":"L"},{"$f":"VLOOKUP(R16,Planning_général!$NV$20:$NW$26,2,0)","v":"Lundi"},{"$f":"VLOOKUP($T$3,Planning_général!$E$17:$NM$17,((($J$2*7)+2)-0),0)","v":0},{"$f":"VLOOKUP($U$3,Planning_général!$E$18:$NM$18,((($J$2*7)+2)-0),0)","v":0},{"$f":"VLOOKUP($V$3,Planning_général!$E$19:$NM$19,((($J$2*7)+2)-0),0)","v":0},{"$f":"VLOOKUP($W$3,Planning_général!$E$20:$NM$20,((($J$2*7)+2)-0),0)","v":0},{"$f":"VLOOKUP($X$3,Planning_général!$E$21:$NM$21,((($J$2*7)+2)-0),0)","v":0},{"$f":"VLOOKUP($Y$3,Planning_général!$E$22:$NM$22,((($J$2*7)+2)-0),0)","v":0},{"$f":"VLOOKUP($Z$3,Planning_général!$E$23:$NM$23,((($J$2*7)+2)-0),0)","v":0},{"$f":"VLOOKUP($AA$3,Planning_général!$E$24:$NM$24,((($J$2*7)+2)-0),0)","v":0},{"$f":"VLOOKUP($AB$3,Planning_général!$E$25:$NM$25,((($J$2*7)+2)-0),0)","v":0},{"$f":"VLOOKUP($AC$3,Planning_général!$E$26:$NM$26,((($J$2*7)+2)-0),0)","v":0},{"$f":"VLOOKUP($AD$3,Planning_général!$E$27:$NM$27,((($J$2*7)+2)-0),0)","v":0},{"$f":"VLOOKUP($AE$3,Planning_général!$E$28:$NM$28,((($J$2*7)+2)-0),0)","v":0},{"$f":"VLOOKUP($AF$3,Planning_général!$E$29:$NM$29,((($J$2*7)+2)-0),0)","v":0},{"$f":"VLOOKUP($AG$3,Planning_général!$E$30:$NM$30,((($J$2*7)+2)-0),0)","v":{"$error":"#N/A"}},{"$f":"IF(ISNA(VLOOKUP($AH$3,Planning_général!$E$31:$NM$31,((($J$2*7)+2)-0),0)),0,VLOOKUP($AH$3,Planning_général!$E$31:$NM$31,((($J$2*7)+2)-0),0))","v":0},null,null,null,"S","Soir","18 h 30 - 01 h 30 ","21 h 00 - 21 h 20",null,"Mal",null,null,null,null,null,null,null,null,null,10]
[null,"SOIR",null,"18 h 30 - 01 h 30 ",null,"Pause",{"$f":"IF(O70=\"\",\"\",O70)","v":""},null,null,{"$f":"IF(G17=\"\",\"\",IF(VLOOKUP(G17,Planning_général!$E$17:$F$62,2,0)=0,\"\",VLOOKUP(G17,Planning_général!$E$17:$F$62,2,0)))","v":""},null,null,null,null,null,null,null,null,null,null,null,null,null,null,null,null,null,null,null,null,null,null,null,null,null,null,null,"N","Nuit","22 h 00 - 05 h 00 ","01 h 00 - 01 h 20",null,"J.A",null,null,null,null,null,null,null,null,null,11]
[null,null,null,null,null,{"$f":"VLOOKUP(D17,$AN$10:$AO$17,2,0)","v":"21 h 00 - 21 h 20"},{"$f":"IF(O71=\"\",\"\",O71)","v":""},null,null,{"$f":"IF(G18=\"\",\"\",IF(VLOOKUP(G18,Planning_général!$E$17:$F$62,2,0)=0,\"\",VLOOKUP(G18,Planning_général!$E$17:$F$62,2,0)))","v":""},null,null,null,null,null,null,null,null,null,null,null,null,null,null,null,null,null,null,null,null,null,null,null,null,null,null,null,"D","DEMARRAGE","4 h 30 - 11 h 30 ","9 h - 9 h 20",null,"Ecole",null,null,null,null,null,null,null,null,null,12]
[null,null,null,null,null,null,"",null,null,{"$f":"IF(G19=\"\",\"\",IF(VLOOKUP(G19,Planning_général!$E$17:$F$62,2,0)=0,\"\",VLOOKUP(G19,Planning_général!$E$17:$F$62,2,0)))","v":""},null,null,null,null,null,null,null,null,"D",{"$f":"IF(COUNTIF($T$10:$T$16,$S$19)=0,\"\",COUNTIF($T$10:$T$16,$S$19))","v":""},{"$f":"IF(COUNTIF($U$10:$U$16,$S$19)=0,\"\",COUNTIF($U$10:$U$16,$S$19))","v":""},{"$f":"IF(COUNTIF($V$10:$V$16,$S$19)=0,\"\",COUNTIF($V$10:$V$16,$S$19))","v":""},{"$f":"IF(COUNTIF($W$10:$W$16,$S$19)=0,\"\",COUNTIF($W$10:$W$16,$S$19))","v":""},{"$f":"IF(COUNTIF($X$10:$X$16,$S$19)=0,\"\",COUNTIF($X$10:$X$16,$S$19))","v":""},{"$f":"IF(COUNTIF($Y$10:$Y$16,$S$19)=0,\"\",COUNTIF($Y$10:$Y$16,$S$19))","v":""},{"$f":"IF(COUNTIF($Z$10:$Z$16,$S$19)=0,\"\",COUNTIF($Z$10:$Z$16,$S$19))","v":""},{"$f":"IF(COUNTIF($AA$10:$AA$16,$S$19)=0,\"\",COUNTIF($AA$10:$AA$16,$S$19))","v":""},{"$f":"IF(COUNTIF($AB$10:$AB$16,$S$19)=0,\"\",COUNTIF($AB$10:$AB$16,$S$19))","v":""},{"$f":"IF(COUNTIF($AC$10:$AC$16,$S$19)=0,\"\",COUNTIF($AC$10:$AC$16,$S$19))","v":""},{"$f":"IF(COUNTIF($AD$10:$AD$16,$S$19)=0,\"\",COUNTIF($AD$10:$AD$16,$S$19))","v":""},{"$f":"IF(COUNTIF($AE$10:$AE$16,$S$19)=0,\"\",COUNTIF($AE$10:$AE$16,$S$19))","v":""},{"$f":"IF(COUNTIF($AF$10:$AF$16,$S$19)=0,\"\",COUNTIF($AF$10:$AF$16,$S$19))","v":""},{"$f":"IF(COUNTIF($AG$10:$AG$16,$S$19)=0,\"\",COUNTIF($AG$10:$AG$16,$S$19))","v":""},{"$f":"IF(COUNTIF($AH$10:$AH$16,$S$19)=0,\"\",COUNTIF($AH$10:$AH$16,$S$19))","v":""},null,null,null,null,null,null,null,null,null,null,null,null,null,null,null,null,null,null,13]
[null,"Nuit",null,"22 h 00 - 05 h 00 ",null,"Pause",{"$f":"IF(O75=\"\",\"\",O75)","v":""},null,null,{"$f":"IF(G20=\"\",\"\",IF(VLOOKUP(G20,Planning_général!$E$17:$F$62,2,0)=0,\"\",VLOOKUP(G20,Planning_général!$E$17:$F$62,2,0)))","v":""},null,null,null,null,null,null,null,null,{"$f":"AL10","v":"AM1"},{"$f":"IF(COUNTIF($T$10:$T$16,S20)=0,\"\",COUNTIF($T$10:$T$16,S20))","v":""},{"$f":"IF(COUNTIF($U$10:$U$16,S20)=0,\"\",COUNTIF($U$10:$U$16,S20))","v":""},{"$f":"IF(COUNTIF($V$10:$V$16,S20)=0,\"\",COUNTIF($V$10:$V$16,S20))","v":""},{"$f":"IF(COUNTIF($W$10:$W$16,S20)=0,\"\",COUNTIF($W$10:$W$16,S20))","v":""},{"$f":"IF(COUNTIF($X$10:$X$16,S20)=0,\"\",COUNTIF($X$10:$X$16,S20))","v":""},{"$f":"IF(COUNTIF($Y$10:$Y$16,S20)=0,\"\",COUNTIF($Y$10:$Y$16,S20))","v":""},{"$f":"IF(COUNTIF($Z$10:$Z$16,S20)=0,\"\",COUNTIF($Z$10:$Z$16,S20))","v":""},{"$f":"IF(COUNTIF($AA$10:$AA$16,$S$20)=0,\"\",COUNTIF($AA$10:$AA$16,$S$20))","v":""},{"$f":"IF(COUNTIF($AB$10:$AB$16,$S$20)=0,\"\",COUNTIF($AB$10:$AB$16,$S$20))","v":""},{"$f":"IF(COUNTIF($AC$10:$AC$16,$S$20)=0,\"\",COUNTIF($AC$10:$AC$16,$S$20))","v":""},{"$f":"IF(COUNTIF($AD$10:$AD$16,$S$20)=0,\"\",COUNTIF($AD$10:$AD$16,$S$20))","v":""},{"$f":"IF(COUNTIF($AE$10:$AE$16,$S$20)=0,\"\",COUNTIF($AE$10:$AE$16,$S$20))","v":""},{"$f":"IF(COUNTIF($AF$10:$AF$16,$S$20)=0,\"\",COUNTIF($AF$10:$AF$16,$S$20))","v":""},{"$f":"IF(COUNTIF($AG$10:$AG$16,$S$20)=0,\"\",COUNTIF($AG$10:$AG$16,$S$20))","v":""},{"$f":"IF(COUNTIF($AH$10:$AH$16,$S$20)=0,\"\",COUNTIF($AH$10:$AH$16,$S$20))","v":""},null,null,null,null,null,null,null,null,null,null,null,null,null,null,null,null,null,null,16]
[null,null,null,null,null,"00 h 00 - 00 h 20",{"$f":"IF(O76=\"\",\"\",O76)","v":""},null,null,{"$f":"IF(G21=\"\",\"\",IF(VLOOKUP(G21,Planning_général!$E$17:$F$62,2,0)=0,\"\",VLOOKUP(G21,Planning_général!$E$17:$F$62,2,0)))","v":""},null,null,null,null,null,null,null,null,"M",{"$f":"IF(COUNTIF($T$10:$T$16,S21)=0,\"\",COUNTIF($T$10:$T$16,S21))","v":""},{"$f":"IF(COUNTIF($U$10:$U$16,S21)=0,\"\",COUNTIF($U$10:$U$16,S21))","v":""},{"$f":"IF(COUNTIF($V$10:$V$16,S21)=0,\"\",COUNTIF($V$10:$V$16,S21))","v":""},{"$f":"IF(COUNTIF($W$10:$W$16,S21)=0,\"\",COUNTIF($W$10:$W$16,S21))","v":""},{"$f":"IF(COUNTIF($X$10:$X$16,S21)=0,\"\",COUNTIF($X$10:$X$16,S21))","v":""},{"$f":"IF(COUNTIF($Y$10:$Y$16,S21)=0,\"\",COUNTIF($Y$10:$Y$16,S21))","v":""},{"$f":"IF(COUNTIF($Z$10:$Z$16,S21)=0,\"\",COUNTIF($Z$10:$Z$16,S21))","v":""},{"$f":"IF(COUNTIF($AA$10:$AA$16,$S$21)=0,\"\",COUNTIF($AA$10:$AA$16,$S$21))","v":""},{"$f":"IF(COUNTIF($AB$10:$AB$16,$S$21)=0,\"\",COUNTIF($AB$10:$AB$16,$S$21))","v":""},{"$f":"IF(COUNTIF($AC$10:$AC$16,$S$21)=0,\"\",COUNTIF($AC$10:$AC$16,$S$21))","v":""},{"$f":"IF(COUNTIF($AD$10:$AD$16,$S$21)=0,\"\",COUNTIF($AD$10:$AD$16,$S$21))","v":""},{"$f":"IF(COUNTIF($AE$10:$AE$16,$S$21)=0,\"\",COUNTIF($AE$10:$AE$16,$S$21))","v":""},{"$f":"IF(COUNTIF($AF$10:$AF$16,$S$21)=0,\"\",COUNTIF($AF$10:$AF$16,$S$21))","v":""},{"$f":"IF(COUNTIF($AG$10:$AG$16,$S$21)=0,\"\",COUNTIF($AG$10:$AG$16,$S$21))","v":""},{"$f":"IF(COUNTIF($AH$10:$AH$16,$S$21)=0,\"\",COUNTIF($AH$10:$AH$16,$S$21))","v":""},null,null,null,null,null,null,null,null,null,null,null,null,null,null,null,null,null,null,17]
[null,null,null,null,null,null,{"$f":"IF(O77=\"\",\"\",O77)","v":""},null,null,{"$f":"IF(G22=\"\",\"\",IF(VLOOKUP(G22,Planning_général!$E$17:$F$62,2,0)=0,\"\",VLOOKUP(G22,Planning_général!$E$17:$F$62,2,0)))","v":""}]
[null,null,null,null,null,null,null,null,null,null,null,null,null,null,null,null,null,null,{"$f":"AL12","v":"AM2"},"","","","","","",{"$f":"IF(COUNTIF($Z$10:$Z$16,S23)=0,\"\",COUNTIF($Z$10:$Z$16,S23))","v":""},{"$f":"IF(COUNTIF($AA$10:$AA$16,S23)=0,\"\",COUNTIF($AA$10:$AA$16,S23))","v":""},{"$f":"IF(COUNTIF($AB$10:$AB$16,$S$23)=0,\"\",COUNTIF($AB$10:$AB$16,$S$23))","v":""},{"$f":"IF(COUNTIF($AC$10:$AC$16,$S$23)=0,\"\",COUNTIF($AC$10:$AC$16,$S$23))","v":""},{"$f":"IF(COUNTIF($AD$10:$AD$16,$S$23)=0,\"\",COUNTIF($AD$10:$AD$16,$S$23))","v":""},{"$f":"IF(COUNTIF($AE$10:$AE$16,$S$23)=0,\"\",COUNTIF($AE$10:$AE$16,$S$23))","v":""},{"$f":"IF(COUNTIF($AF$10:$AF$16,$S$23)=0,\"\",COUNTIF($AF$10:$AF$16,$S$23))","v":""},{"$f":"IF(COUNTIF($AG$10:$AG$16,$S$23)=0,\"\",COUNTIF($AG$10:$AG$16,$S$23))","v":""},{"$f":"IF(COUNTIF($AH$10:$AH$16,$S$23)=0,\"\",COUNTIF($AH$10:$AH$16,$S$23))","v":""},null,null,null,null,null,null,null,null,null,null,null,null,null,null,null,null,null,null,18]
[null,"SAMEDI",null,"4 h 30 - 11 h 30 ",null,"Pause",{"$f":"IF(O42=\"\",\"\",O42)","v":""},null,null,{"$f":"IF(G24=\"\",\"\",IF(VLOOKUP(G24,Planning_général!$E$17:$F$62,2,0)=0,\"\",VLOOKUP(G24,Planning_général!$E$17:$F$62,2,0)))","v":""},null,null,null,null,null,null,null,null,"J","","","","","","","",{"$f":"IF(COUNTIF($AA$10:$AA$16,$S$24)=0,\"\",COUNTIF($AA$10:$AA$16,$S$24))","v":""},{"$f":"IF(COUNTIF($AB$10:$AB$16,$S$24)=0,\"\",COUNTIF($AB$10:$AB$16,$S$24))","v":""},{"$f":"IF(COUNTIF($AC$10:$AC$16,$S$24)=0,\"\",COUNTIF($AC$10:$AC$16,$S$24))","v":""},{"$f":"IF(COUNTIF($AD$10:$AD$16,$S$24)=0,\"\",COUNTIF($AD$10:$AD$16,$S$24))","v":""},{"$f":"IF(COUNTIF($AE$10:$AE$16,$S$24)=0,\"\",COUNTIF($AE$10:$AE$16,$S$24))","v":""},{"$f":"IF(COUNTIF($AF$10:$AF$16,$S$24)=0,\"\",COUNTIF($AF$10:$AF$16,$S$24))","v":""},{"$f":"IF(COUNTIF($AG$10:$AG$16,$S$24)=0,\"\",COUNTIF($AG$10:$AG$16,$S$24))","v":""},{"$f":"IF(COUNTIF($AH$10:$AH$16,$S$24)=0,\"\",COUNTIF($AH$10:$AH$16,$S$24))","v":""},null,null,null,null,null,null,null,null,null,null,null,null,null,null,null,null,null,null,19]
[null,null,null,null,null,{"$f":"VLOOKUP(D24,$AN$10:$AO$17,2,0)","v":"9 h - 9 h 20"},"",null,null,{"$f":"IF(G25=\"\",\"\",IF(VLOOKUP(G25,Planning_général!$E$17:$F$62,2,0)=0,\"\",VLOOKUP(G25,Planning_général!$E$17:$F$62,2,0)))","v":""},null,null,null,null,null,null,null,null,"AM3","","","","","","",{"$f":"IF(COUNTIF($Z$10:$Z$16,$S$25)=0,\"\",COUNTIF($Z$10:$Z$16,S25))","v":""},{"$f":"IF(COUNTIF($AA$10:$AA$16,$S$25)=0,\"\",COUNTIF($AA$10:$AA$16,$S$25))","v":""},{"$f":"IF(COUNTIF($AB$10:$AB$16,$S$25)=0,\"\",COUNTIF($AB$10:$AB$16,$S$25))","v":""},{"$f":"IF(COUNTIF($AC$10:$AC$16,$S$25)=0,\"\",COUNTIF($AC$10:$AC$16,$S$25))","v":""},{"$f":"IF(COUNTIF($AD$10:$AD$16,$S$25)=0,\"\",COUNTIF($AD$10:$AD$16,$S$25))","v":""},{"$f":"IF(COUNTIF($AE$10:$AE$16,$S$25)=0,\"\",COUNTIF($AE$10:$AE$16,$S$25))","v":""},{"$f":"IF(COUNTIF($AF$10:$AF$16,$S$25)=0,\"\",COUNTIF($AF$10:$AF$16,$S$25))","v":""},{"$f":"IF(COUNTIF($AG$10:$AG$16,$S$25)=0,\"\",COUNTIF($AG$10:$AG$16,$S$25))","v":""},{"$f":"IF(COUNTIF($AH$10:$AH$16,$S$25)=0,\"\",COUNTIF($AH$10:$AH$16,$S$25))","v":""},null,null,null,null,null,null,null,null,null,null,null,null,null,null,null,null,null,null,20]
[null,null,null,"6 h 00 - 13 h 00 ",null,"Pause","",null,null,{"$f":"IF(G26=\"\",\"\",IF(VLOOKUP(G26,Planning_général!$E$17:$F$62,2,0)=0,\"\",VLOOKUP(G26,Planning_général!$E$17:$F$62,2,0)))","v":""},null,null,null,null,null,null,null,null,"AP","","","","","","",{"$f":"IF(COUNTIF($Z$10:$Z$16,$S$26)=0,\"\",COUNTIF($Z$10:$Z$16,S26))","v":""},{"$f":"IF(COUNTIF($AA$10:$AA$16,$S$26)=0,\"\",COUNTIF($AA$10:$AA$16,$S$26))","v":""},{"$f":"IF(COUNTIF($AB$10:$AB$16,$S$26)=0,\"\",COUNTIF($AB$10:$AB$16,$S$26))","v":""},{"$f":"IF(COUNTIF($AC$10:$AC$16,$S$26)=0,\"\",COUNTIF($AC$10:$AC$16,$S$26))","v":""},{"$f":"IF(COUNTIF($AD$10:$AD$16,$S$26)=0,\"\",COUNTIF($AD$10:$AD$16,$S$26))","v":""},{"$f":"IF(COUNTIF($AE$10:$AE$16,$S$26)=0,\"\",COUNTIF($AE$10:$AE$16,$S$26))","v":""},{"$f":"IF(COUNTIF($AF$10:$AF$16,$S$26)=0,\"\",COUNTIF($AF$10:$AF$16,$S$26))","v":""},{"$f":"IF(COUNTIF($AG$10:$AG$16,$S$26)=0,\"\",COUNTIF($AG$10:$AG$16,$S$26))","v":""},{"$f":"IF(COUNTIF($AH$10:$AH$16,$S$26)=0,\"\",COUNTIF($AH$10:$AH$16,$S$26))","v":""},null,null,null,null,null,null,null,null,null,null,null,null,null,null,null,null,null,null,21]
[null,null,null,null,null,{"$f":"VLOOKUP(D26,$AN$10:$AO$17,2,0)","v":"9 h 20 - 9 h 40"},{"$f":"IF(O45=\"\",\"\",O45)","v":""},null,null,{"$f":"IF(G27=\"\",\"\",IF(VLOOKUP(G27,Planning_général!$E$17:$F$62,2,0)=0,\"\",VLOOKUP(G27,Planning_général!$E$17:$F$62,2,0)))","v":""},null,null,null,null,null,null,null,null,"S","","","","","","",{"$f":"IF(COUNTIF($Z$10:$Z$16,$S$27)=0,\"\",COUNTIF($Z$10:$Z$16,S27))","v":""},{"$f":"IF(COUNTIF($AA$10:$AA$16,$S$27)=0,\"\",COUNTIF($AA$10:$AA$16,$S$27))","v":""},{"$f":"IF(COUNTIF($AB$10:$AB$16,$S$27)=0,\"\",COUNTIF($AB$10:$AB$16,$S$27))","v":""},{"$f":"IF(COUNTIF($AC$10:$AC$16,$S$27)=0,\"\",COUNTIF($AC$10:$AC$16,$S$27))","v":""},{"$f":"IF(COUNTIF($AD$10:$AD$16,$S$27)=0,\"\",COUNTIF($AD$10:$AD$16,$S$27))","v":""},{"$f":"IF(COUNTIF($AE$10:$AE$16,$S$27)=0,\"\",COUNTIF($AE$10:$AE$16,$S$27))","v":""},{"$f":"IF(COUNTIF($AF$10:$AF$16,$S$27)=0,\"\",COUNTIF($AF$10:$AF$16,$S$27))","v":""},{"$f":"IF(COUNTIF($AG$10:$AG$16,$S$27)=0,\"\",COUNTIF($AG$10:$AG$16,$S$27))","v":""},{"$f":"IF(COUNTIF($AH$10:$AH$16,$S$27)=0,\"\",COUNTIF($AH$10:$AH$16,$S$27))","v":""},null,null,null,null,null,null,null,null,null,null,null,null,null,null,null,null,null,null,22]
[null,null,null,"7 h 00 - 14 h 00 ",null,"Pause","",null,null,{"$f":"IF(G28=\"\",\"\",IF(VLOOKUP(G28,Planning_général!$E$17:$F$62,2,0)=0,\"\",VLOOKUP(G28,Planning_général!$E$17:$F$62,2,0)))","v":""},null,null,null,null,null,null,null,null,"N","","","","","","","",{"$f":"IF(COUNTIF($AA$10:$AA$16,$S$28)=0,\"\",COUNTIF($AA$10:$AA$16,$S$28))","v":""},{"$f":"IF(COUNTIF($AB$10:$AB$16,$S$28)=0,\"\",COUNTIF($AB$10:$AB$16,$S$28))","v":""},{"$f":"IF(COUNTIF($AC$10:$AC$16,$S$28)=0,\"\",COUNTIF($AC$10:$AC$16,$S$28))","v":""},{"$f":"IF(COUNTIF($AD$10:$AD$16,$S$28)=0,\"\",COUNTIF($AD$10:$AD$16,$S$28))","v":""},{"$f":"IF(COUNTIF($AE$10:$AE$16,$S$28)=0,\"\",COUNTIF($AE$10:$AE$16,$S$28))","v":""},{"$f":"IF(COUNTIF($AF$10:$AF$16,$S$28)=0,\"\",COUNTIF($AF$10:$AF$16,$S$28))","v":""},{"$f":"IF(COUNTIF($AG$10:$AG$16,$S$28)=0,\"\",COUNTIF($AG$10:$AG$16,$S$28))","v":""},{"$f":"IF(COUNTIF($AH$10:$AH$16,$S$28)=0,\"\",COUNTIF($AH$10:$AH$16,$S$28))","v":""},null,null,null,null,null,null,null,null,null,null,null,null,null,null,null,null,null,null,23]
[null,null,null,null,null,{"$f":"VLOOKUP(D28,$AN$10:$AO$17,2,0)","v":"9 h 40 - 10 h 00"},"",null,null,{"$f":"IF(G29=\"\",\"\",IF(VLOOKUP(G29,Planning_général!$E$17:$F$62,2,0)=0,\"\",VLOOKUP(G29,Planning_général!$E$17:$F$62,2,0)))","v":""},null,null,null,null,null,null,null,null,"Max",{"$f":"MAX(T19:T28)","v":0},{"$f":"MAX(U19:U28)","v":0},0,0,0,0,0,0,0,0,0,0,0,0,{"$f":"MAX(AH19:AH28)","v":0},null,null,null,null,null,null,null,null,null,null,null,null,null,null,null,null,null,null,24]
[null,null,null,null,null,null,null,null,null,null,null,null,null,null,null,null,null,null,"Mini",{"$f":"MIN(T20:T28)","v":0},0,0,0,0,0,0,0,0,0,0,0,0,0,0,null,null,null,null,null,null,null,null,null,null,null,null,null,null,null,null,null,null,25]
[null,"Absences (CP/ Modul/ Repos/ Formation)",null,"Lundi",{"$f":"VLOOKUP(D31,$L$84:$P$90,3,0)","v":""},null,null,null,null,null,null,null,null,null,"Techniciens",null,null,null,null,null,null,null,null,null,null,null,null,null,null,null,null,null,null,null,null,null,null,null,null,null,null,null,null,null,null,null,null,null,null,null,null,null,26]
[null,null,null,"Mardi","",null,null,null,null,null,null,null,null,null,null,null,null,null,null,{"$f":"IF(T29=0,\"\",IF(T19=T29,$S$19,IF(T20=T29,$S$20,IF(T21=T29,$S$21,IF(T23=T29,$S$23,IF(T24=T29,$S$24,IF(T25=T29,$S$25,IF(T26=T29,$S$26,IF(T27=T29,$S$27,IF(T28=T29,$S$28,\"\"))))))))))","v":""},{"$f":"IF(U29=0,\"\",IF(U19=U29,$S$19,IF(U20=U29,$S$20,IF(U21=U29,$S$21,IF(U23=U29,$S$23,IF(U24=U29,$S$24,IF(U25=U29,$S$25,IF(U26=U29,$S$26,IF(U27=U29,$S$27,IF(U28=U29,$S$28,\"\"))))))))))","v":""},{"$f":"IF(V29=0,\"\",IF(V19=V29,$S$19,IF(V20=V29,$S$20,IF(V21=V29,$S$21,IF(V23=V29,$S$23,IF(V24=V29,$S$24,IF(V25=V29,$S$25,IF(V26=V29,$S$26,IF(V27=V29,$S$27,IF(V28=V29,$S$28,\"\"))))))))))","v":""},"","","","","","","","","","","",{"$f":"IF(AH29=0,\"\",IF(AH19=AH29,$S$19,IF(AH20=AH29,$S$20,IF(AH21=AH29,$S$21,IF(AH23=AH29,$S$23,IF(AH24=AH29,$S$24,IF(AH25=AH29,$S$25,IF(AH26=AH29,$S$26,IF(AH27=AH29,$S$27,IF(AH28=AH29,$S$28,\"\"))))))))))","v":""},null,null,null,null,null,null,null,null,null,null,null,null,null,null,null,null,null,null,27]
[null,null,null,"Mercredi","",null,null,null,null,null,null,null,null,null,{"$f":"IF(T33=1,$T$3,IF(U33=1,$U$3,IF(V33=1,$V$3,IF(W33=1,W3,IF(X33=1,$X$3,IF(Y33=1,$Y$3,IF(Z33=1,$Z$3,IF(AA33=1,$AA$3,IF(AB33=1,$AB$3,IF(AC33=1,$AC$3,IF(AD33=1,$AD$3,IF(AE33=1,AE3,IF(AF33=1,$AF$3,IF(AG33=1,$AG$3,IF(AH33=1,$AH$3,\"\")))))))))))))))","v":""},{"$f":"IF(R33=1,R$9,IF(S33=1,S$9,IF(T33=1,T$9,IF(U33=1,U$9,IF(V33=1,V$9,IF(W33=1,W$9,IF(X33=1,X$9,IF(Y33=1,Y$9,IF(Z33=1,Z$9,IF(AA33=1,AA$9,IF(AB33=1,AB$9,\"\")))))))))))","v":""},"Jrnée",null,"J",{"$f":"IF($S$33=T32,1,\"\")","v":""},{"$f":"IF(AND($S$33=$U$32,T33=\"\"),1,\"\")","v":""},{"$f":"IF(AND($S$33=$V$32,U33=\"\",T33=\"\"),1,\"\")","v":""},{"$f":"IF(AND($S$33=W32,T33=\"\",U33=\"\",V33=\"\"),1,\"\")","v":""},{"$f":"IF(AND($S$33=X32,U33=\"\",V33=\"\",W33=\"\",T33=\"\"),1,\"\")","v":""},{"$f":"IF(AND($S$33=Y32,V33=\"\",W33=\"\",X33=\"\",U33=\"\",T33=\"\"),1,\"\")","v":""},{"$f":"IF(AND($S$33=Z32,W33=\"\",X33=\"\",Y33=\"\",V33=\"\",U33=\"\",T33=\"\"),1,\"\")","v":""},{"$f":"IF(AND($S$33=AA32,X33=\"\",Y33=\"\",Z33=\"\",W33=\"\",V33=\"\",U33=\"\",T33=\"\"),1,\"\")","v":""},{"$f":"IF(AND($S$33=AB32,Y33=\"\",Z33=\"\",AA33=\"\",X33=\"\",W33=\"\",V33=\"\",U33=\"\",T33=\"\"),1,\"\")","v":""},{"$f":"IF(AND($S$33=AC32,Z33=\"\",AA33=\"\",AB33=\"\",Y33=\"\",X33=\"\",W33=\"\",V33=\"\",U33=\"\",T33=\"\"),1,\"\")","v":""},{"$f":"IF(AND($S$33=AD32,AA33=\"\",AB33=\"\",AC33=\"\",Z33=\"\",Y33=\"\",X33=\"\",W33=\"\",V33=\"\",U33=\"\",T33=\"\"),1,\"\")","v":""},{"$f":"IF(AND($S$33=AE32,AB33=\"\",AC33=\"\",AD33=\"\",AA33=\"\",Z33=\"\",Y33=\"\",X33=\"\",W33=\"\",V33=\"\",U33=\"\",T33=\"\"),1,\"\")","v":""},{"$f":"IF(AND($S$33=AF32,AC33=\"\",AD33=\"\",AE33=\"\",AB33=\"\",AA33=\"\",Z33=\"\",Y33=\"\",X33=\"\",W33=\"\",V33=\"\",U33=\"\",T33=\"\"),1,\"\")","v":""},{"$f":"IF(AND($S$33=AG32,AD33=\"\",AE33=\"\",AF33=\"\",AC33=\"\",AB33=\"\",AA33=\"\",Z33=\"\",Y33=\"\",X33=\"\",W33=\"\",V33=\"\",U33=\"\",T33=\"\"),1,\"\")","v":""},{"$f":"IF(AND($S$33=AH32,AE33=\"\",AF33=\"\",AG33=\"\",AD33=\"\",AC33=\"\",AB33=\"\",AA33=\"\",Z33=\"\",Y33=\"\",X33=\"\",W33=\"\",V33=\"\",U33=\"\",T33=\"\"),1,\"\")","v":""},null,null,null,null,null,null,null,null,null,null,null,null,null,null,null,null,null,null,28]
[null,null,null,"Jeudi","",null,null,null,null,null,null,null,null,null,{"$f":"IF(T34=1,$T$3,IF(U34=1,$U$3,IF(V34=1,$V$3,IF(W34=1,W4,IF(X34=1,$X$3,IF(Y34=1,$Y$3,IF(Z34=1,$Z$3,IF(AA34=1,$AA$3,IF(AB34=1,$AB$3,IF(AC34=1,$AC$3,IF(AD34=1,$AD$3,IF(AE34=1,AE4,IF(AF34=1,$AF$3,IF(AG34=1,$AG$3,IF(AH34=1,$AH$3,\"\")))))))))))))))","v":""},{"$f":"IF(R34=1,R$9,IF(S34=1,S$9,IF(T34=1,T$9,IF(U34=1,U$9,IF(V34=1,V$9,IF(W34=1,W$9,IF(X34=1,X$9,IF(Y34=1,Y$9,IF(Z34=1,Z$9,IF(AA34=1,AA$9,IF(AB34=1,AB$9,\"\")))))))))))","v":""},null,null,"J",null,{"$f":"IF(AND(U$32=$S$34,T34=\"\",U33=\"\"),1,\"\")","v":""},{"$f":"IF(AND(V$32=$S$34,U34=\"\",V33=\"\"),1,\"\")","v":""},{"$f":"IF(AND(W$32=$S$34,V34=\"\",W33=\"\"),1,\"\")","v":""},{"$f":"IF(AND(X$32=$S$34,X33=\"\",SUM($U$34:W34)=0),1,\"\")","v":""},{"$f":"IF(AND(Y$32=$S$34,Y33=\"\",SUM($U$34:X34)=0),1,\"\")","v":""},{"$f":"IF(AND(Z$32=$S$34,Z33=\"\",SUM($U$34:Y34)=0),1,\"\")","v":""},{"$f":"IF(AND(AA$32=$S$34,AA33=\"\",SUM($U$34:Z34)=0),1,\"\")","v":""},{"$f":"IF(AND(AB$32=$S$34,AB33=\"\",SUM($U$34:AA34)=0),1,\"\")","v":""},{"$f":"IF(AND(AC$32=$S$34,AC33=\"\",SUM($U$34:AB34)=0),1,\"\")","v":""},{"$f":"IF(AND(AD$32=$S$34,AD33=\"\",SUM($U$34:AC34)=0),1,\"\")","v":""},{"$f":"IF(AND(AE$32=$S$34,AE33=\"\",SUM($U$34:AD34)=0),1,\"\")","v":""},{"$f":"IF(AND(AF$32=$S$34,AF33=\"\",SUM($U$34:AE34)=0),1,\"\")","v":""},{"$f":"IF(AND(AG$32=$S$34,AG33=\"\",SUM($U$34:AF34)=0),1,\"\")","v":""},{"$f":"IF(AND(AH$32=$S$34,AH33=\"\",SUM($U$34:AG34)=0),1,\"\")","v":""},null,null,null,null,null,null,null,null,null,null,null,null,null,null,null,null,null,null,29]
[null,null,null,"Vendredi","",null,null,null,null,null,null,null,null,null,{"$f":"IF(T35=1,$T$3,IF(U35=1,$U$3,IF(V35=1,$V$3,IF(W35=1,W3,IF(X35=1,$X$3,IF(Y35=1,$Y$3,IF(Z35=1,$Z$3,IF(AA35=1,$AA$3,IF(AB35=1,$AB$3,IF(AC35=1,$AC$3,IF(AD35=1,$AD$3,IF(AE35=1,AE3,IF(AF35=1,$AF$3,IF(AG35=1,$AG$3,IF(AH35=1,$AH$3,\"\")))))))))))))))","v":""},{"$f":"IF(R35=1,R$9,IF(S35=1,S$9,IF(T35=1,T$9,IF(U35=1,U$9,IF(V35=1,V$9,IF(W35=1,W$9,IF(X35=1,X$9,IF(Y35=1,Y$9,IF(Z35=1,Z$9,IF(AA35=1,AA$9,IF(AB35=1,AB$9,\"\")))))))))))","v":""},null,null,"J",null,null,{"$f":"IF(AND(V$32=S35,U35=\"\",V34=\"\",V33=\"\"),1,\"\")","v":""},{"$f":"IF(AND(W$32=S35,V35=\"\",W34=\"\",W33=\"\"),1,\"\")","v":""},{"$f":"IF(AND(X$32=$S$35,X33=\"\",X34=\"\",SUM($V$35:W35)=0),1,\"\")","v":""},{"$f":"IF(AND(Y$32=$S$35,Y33=\"\",Y34=\"\",SUM($V$35:X35)=0),1,\"\")","v":""},{"$f":"IF(AND(Z$32=$S$35,Z33=\"\",Z34=\"\",SUM($V$35:Y35)=0),1,\"\")","v":""},{"$f":"IF(AND(AA$32=$S$35,AA33=\"\",AA34=\"\",SUM($V$35:Z35)=0),1,\"\")","v":""},{"$f":"IF(AND(AB$32=$S$35,AB33=\"\",AB34=\"\",SUM($V$35:AA35)=0),1,\"\")","v":""},{"$f":"IF(AND(AC$32=$S$35,AC33=\"\",AC34=\"\",SUM($V$35:AB35)=0),1,\"\")","v":""},{"$f":"IF(AND(AD$32=$S$35,AD33=\"\",AD34=\"\",SUM($V$35:AC35)=0),1,\"\")","v":""},{"$f":"IF(AND(AE$32=$S$35,AE33=\"\",AE34=\"\",SUM($V$35:AD35)=0),1,\"\")","v":""},{"$f":"IF(AND(AF$32=$S$35,AF33=\"\",AF34=\"\",SUM($V$35:AE35)=0),1,\"\")","v":""},{"$f":"IF(AND(AG$32=$S$35,AG33=\"\",AG34=\"\",SUM($V$35:AF35)=0),1,\"\")","v":""},{"$f":"IF(AND(AH$32=$S$35,AH33=\"\",AH34=\"\",SUM($V$35:AG35)=0),1,\"\")","v":""}]
[null,null,null,"Samedi",""]
[null,null,null,null,null,null,null,null,null,null,null,null,null,null,{"$f":"IF(T37=1,$T$3,IF(U37=1,$U$3,IF(V37=1,$V$3,IF(W37=1,W3,IF(X37=1,$X$3,IF(Y37=1,$Y$3,IF(Z37=1,$Z$3,IF(AA37=1,$AA$3,IF(AB37=1,$AB$3,IF(AC37=1,$AC$3,IF(AD37=1,$AD$3,IF(AE37=1,AE7,IF(AF37=1,$AF$3,IF(AG37=1,$AG$3,IF(AH37=1,$AH$3,\"\")))))))))))))))","v":""},{"$f":"IF(R37=1,R$9,IF(S37=1,S$9,IF(T37=1,T$9,IF(U37=1,U$9,IF(V37=1,V$9,IF(W37=1,W$9,IF(X37=1,X$9,IF(Y37=1,Y$9,IF(Z37=1,Z$9,IF(AA37=1,AA$9,IF(AB37=1,AB$9,\"\")))))))))))","v":""},"Début",null,"AM1",{"$f":"IF($S$37=T32,1,\"\")","v":""},{"$f":"IF(AND($S$37=$U$32,T37=\"\"),1,\"\")","v":""},{"$f":"IF(AND($S$37=$V$32,U37=\"\",T37=\"\"),1,\"\")","v":""},{"$f":"IF(AND($S$37=W32,T37=\"\",U37=\"\",V37=\"\"),1,\"\")","v":""},{"$f":"IF(AND($S$37=X32,U37=\"\",V37=\"\",W37=\"\",T37=\"\"),1,\"\")","v":""},{"$f":"IF(AND($S$37=Y32,V37=\"\",W37=\"\",X37=\"\",U37=\"\",T37=\"\"),1,\"\")","v":""},{"$f":"IF(AND($S$37=Z32,W37=\"\",X37=\"\",Y37=\"\",V37=\"\",U37=\"\",T37=\"\"),1,\"\")","v":""},{"$f":"IF(AND($S$37=AA32,X37=\"\",Y37=\"\",Z37=\"\",W37=\"\",V37=\"\",U37=\"\",T37=\"\"),1,\"\")","v":""},{"$f":"IF(AND($S$37=AB32,Y37=\"\",Z37=\"\",AA37=\"\",X37=\"\",W37=\"\",V37=\"\",U37=\"\",T37=\"\"),1,\"\")","v":""},{"$f":"IF(AND($S$37=AC32,Z37=\"\",AA37=\"\",AB37=\"\",Y37=\"\",X37=\"\",W37=\"\",V37=\"\",U37=\"\",T37=\"\"),1,\"\")","v":""},{"$f":"IF(AND($S$37=AD36,AA37=\"\",AB37=\"\",AC37=\"\",Z37=\"\",Y37=\"\",X37=\"\",W37=\"\",V37=\"\",U37=\"\",T37=\"\"),1,\"\")","v":""},{"$f":"IF(AND($S$37=AE36,AB37=\"\",AC37=\"\",AD37=\"\",AA37=\"\",Z37=\"\",Y37=\"\",X37=\"\",W37=\"\",V37=\"\",U37=\"\",T37=\"\"),1,\"\")","v":""},{"$f":"IF(AND($S$37=AF32,AC37=\"\",AD37=\"\",AE37=\"\",AB37=\"\",AA37=\"\",Z37=\"\",Y37=\"\",X37=\"\",W37=\"\",V37=\"\",U37=\"\",T37=\"\"),1,\"\")","v":""},{"$f":"IF(AND($S$37=AG36,AD37=\"\",AE37=\"\",AF37=\"\",AC37=\"\",AB37=\"\",AA37=\"\",Z37=\"\",Y37=\"\",X37=\"\",W37=\"\",V37=\"\",U37=\"\",T37=\"\"),1,\"\")","v":""},{"$f":"IF(AND($S$37=AH36,AE37=\"\",AF37=\"\",AG37=\"\",AD37=\"\",AC37=\"\",AB37=\"\",AA37=\"\",Z37=\"\",Y37=\"\",X37=\"\",W37=\"\",V37=\"\",U37=\"\",T37=\"\"),1,\"\")","v":""}]
[null,null,null,null,null,null,null,null,null,null,null,null,null,null,{"$f":"IF(T38=1,$T$3,IF(U38=1,$U$3,IF(V38=1,$V$3,IF(W38=1,W3,IF(X38=1,$X$3,IF(Y38=1,$Y$3,IF(Z38=1,$Z$3,IF(AA38=1,$AA$3,IF(AB38=1,$AB$3,IF(AC38=1,$AC$3,IF(AD38=1,$AD$3,IF(AE38=1,AE3,IF(AF38=1,$AF$3,IF(AG38=1,$AG$3,IF(AH38=1,$AH$3,\"\")))))))))))))))","v":""},{"$f":"IF(R38=1,R$9,IF(S38=1,S$9,IF(T38=1,T$9,IF(U38=1,U$9,IF(V38=1,V$9,IF(W38=1,W$9,IF(X38=1,X$9,IF(Y38=1,Y$9,IF(Z38=1,Z$9,IF(AA38=1,AA$9,IF(AB38=1,AB$9,\"\")))))))))))","v":""},null,null,"AM1",null,{"$f":"IF(AND(U$32=$S$38,T38=\"\",U37=\"\"),1,\"\")","v":""},{"$f":"IF(AND(V$32=$S$38,U38=\"\",V37=\"\"),1,\"\")","v":""},{"$f":"IF(AND(W$32=$S$38,V38=\"\",W37=\"\"),1,\"\")","v":""},{"$f":"IF(AND(X$32=$S$38,X37=\"\",SUM($U$38:W38)=0),1,\"\")","v":""},{"$f":"IF(AND(Y$32=$S$38,Y37=\"\",SUM($U$38:X38)=0),1,\"\")","v":""},{"$f":"IF(AND(Z$32=$S$38,Z37=\"\",SUM($U$38:Y38)=0),1,\"\")","v":""},{"$f":"IF(AND(AA$32=$S$38,AA37=\"\",SUM($U$38:Z38)=0),1,\"\")","v":""},{"$f":"IF(AND(AB$32=$S$38,AB37=\"\",SUM($U$38:AA38)=0),1,\"\")","v":""},{"$f":"IF(AND(AC$32=$S$38,AC37=\"\",SUM($U$38:AB38)=0),1,\"\")","v":""},{"$f":"IF(AND(AD$32=$S$38,AD37=\"\",SUM($U$38:AC38)=0),1,\"\")","v":""},{"$f":"IF(AND(AE$32=$S$38,AE37=\"\",SUM($U$38:AD38)=0),1,\"\")","v":""},{"$f":"IF(AND(AF$32=$S$38,AF37=\"\",SUM($U$38:AE38)=0),1,\"\")","v":""},{"$f":"IF(AND(AG$32=$S$38,AG37=\"\",SUM($U$38:AF38)=0),1,\"\")","v":""},{"$f":"IF(AND(AH$32=$S$38,AH37=\"\",SUM($U$38:AG38)=0),1,\"\")","v":""}]
[null,null,null,null,null,null,null,null,null,null,null,null,null,null,{"$f":"IF(T39=1,$T$3,IF(U39=1,$U$3,IF(V39=1,$V$3,IF(W39=1,$W$3,IF(X39=1,$X$3,IF(Y39=1,$Y$3,IF(Z39=1,$Z$3,IF(AA39=1,$AA$3,IF(AB39=1,$AB$3,IF(AC39=1,$AC$3,IF(AD39=1,$AD$3,IF(AE39=1,$AE$3,IF(AF39=1,$AF$3,IF(AG39=1,$AG$3,IF(AH39=1,$AH$3,\"\")))))))))))))))","v":""},"",null,null,"AM1",null,null,{"$f":"IF(AND(V$32=S39,U39=\"\",V38=\"\",V37=\"\"),1,\"\")","v":""},{"$f":"IF(AND(W$32=S39,V39=\"\",W38=\"\",W37=\"\"),1,\"\")","v":""},{"$f":"IF(AND(X$32=$S$39,X37=\"\",X38=\"\",SUM($V$39:W39)=0),1,\"\")","v":""},{"$f":"IF(AND(Y$32=$S$39,Y37=\"\",Y38=\"\",SUM($V$39:X39)=0),1,\"\")","v":""},{"$f":"IF(AND(Z$32=$S$39,Z37=\"\",Z38=\"\",SUM($V$39:Y39)=0),1,\"\")","v":""},{"$f":"IF(AND(AA$32=$S$39,AA37=\"\",AA38=\"\",SUM($V$39:Z39)=0),1,\"\")","v":""},{"$f":"IF(AND(AB$32=$S$39,AB37=\"\",AB38=\"\",SUM($V$39:AA39)=0),1,\"\")","v":""},{"$f":"IF(AND(AC$32=$S$39,AC37=\"\",AC38=\"\",SUM($V$39:AB39)=0),1,\"\")","v":""},{"$f":"IF(AND(AD$32=$S$39,AD37=\"\",AD38=\"\",SUM($V$39:AC39)=0),1,\"\")","v":""},{"$f":"IF(AND(AE$32=$S$39,AE37=\"\",AE38=\"\",SUM($V$39:AD39)=0),1,\"\")","v":""},{"$f":"IF(AND(AF$32=$S$39,AF37=\"\",AF38=\"\",SUM($V$39:AE39)=0),1,\"\")","v":""},{"$f":"IF(AND(AG$32=$S$39,AG37=\"\",AG38=\"\",SUM($V$39:AF39)=0),1,\"\")","v":""},{"$f":"IF(AND(AH$32=$S$39,AH37=\"\",AH38=\"\",SUM($V$39:AG39)=0),1,\"\")","v":""},null,null,null,null,null,null,null,null,null,null,null,null,null,null,null,null,null,null,30]
[]
[null,null,null,null,null,null,null,null,null,null,null,null,null,null,null,null,null,null,null,{"$f":"IF(T30=0,\"\",IF(T20=T30,$S$20,IF(T21=T30,$S$21,IF(T23=T30,$S$23,IF(T24=T30,$S$24,IF(T25=T30,$S$25,IF(T26=T30,$S$26,IF(T27=T30,$S$27,IF(T28=T30,$S$28,\"\")))))))))","v":""},"","","","","","","","","","","","","",""]
[null,null,null,null,null,null,null,null,null,null,null,null,null,null,{"$f":"IF(T42=1,$T$3,IF(U42=1,$U$3,IF(V42=1,$V$3,IF(W42=1,W3,IF(X42=1,$X$3,IF(Y42=1,$Y$3,IF(Z42=1,$Z$3,IF(AA42=1,$AA$3,IF(AB42=1,$AB$3,IF(AC42=1,$AC$3,IF(AD42=1,$AD$3,IF(AE42=1,AE3,IF(AF42=1,$AF$3,IF(AG42=1,$AG$3,IF(AH42=1,$AH$3,\"\")))))))))))))))","v":""},null,null,null,"AM1",{"$f":"IF($S$42=T41,1,\"\")","v":""},{"$f":"IF(AND($S$42=$U$41,T42=\"\"),1,\"\")","v":""},{"$f":"IF(AND($S$42=$V$41,U42=\"\",T42=\"\"),1,\"\")","v":""},{"$f":"IF(AND($S$42=W41,T42=\"\",U42=\"\",V42=\"\"),1,\"\")","v":""},{"$f":"IF(AND($S$42=X41,U42=\"\",V42=\"\",W42=\"\",T42=\"\"),1,\"\")","v":""},{"$f":"IF(AND($S$42=Y41,V42=\"\",W42=\"\",X42=\"\",U42=\"\",T42=\"\"),1,\"\")","v":""},{"$f":"IF(AND($S$42=Z41,W42=\"\",X42=\"\",Y42=\"\",V42=\"\",U42=\"\",T42=\"\"),1,\"\")","v":""},{"$f":"IF(AND($S$42=AA41,X42=\"\",Y42=\"\",Z42=\"\",W42=\"\",V42=\"\",U42=\"\",T42=\"\"),1,\"\")","v":""},{"$f":"IF(AND($S$42=AB41,Y42=\"\",Z42=\"\",AA42=\"\",X42=\"\",W42=\"\",V42=\"\",U42=\"\",T42=\"\"),1,\"\")","v":""},{"$f":"IF(AND($S$42=AC41,Z42=\"\",AA42=\"\",AB42=\"\",Y42=\"\",X42=\"\",W42=\"\",V42=\"\",U42=\"\",T42=\"\"),1,\"\")","v":""},{"$f":"IF(AND($S$42=AD41,AA42=\"\",AB42=\"\",AC42=\"\",Z42=\"\",Y42=\"\",X42=\"\",W42=\"\",V42=\"\",U42=\"\",T42=\"\"),1,\"\")","v":""},{"$f":"IF(AND($S$42=AE41,AB42=\"\",AC42=\"\",AD42=\"\",AA42=\"\",Z42=\"\",Y42=\"\",X42=\"\",W42=\"\",V42=\"\",U42=\"\",T42=\"\"),1,\"\")","v":""},{"$f":"IF(AND($S$42=AF41,AC42=\"\",AD42=\"\",AE42=\"\",AB42=\"\",AA42=\"\",Z42=\"\",Y42=\"\",X42=\"\",W42=\"\",V42=\"\",U42=\"\",T42=\"\"),1,\"\")","v":""},{"$f":"IF(AND($S$42=AG41,AD42=\"\",AE42=\"\",AF42=\"\",AC42=\"\",AB42=\"\",AA42=\"\",Z42=\"\",Y42=\"\",X42=\"\",W42=\"\",V42=\"\",U42=\"\",T42=\"\"),1,\"\")","v":""},{"$f":"IF(AND($S$42=AH41,AE42=\"\",AF42=\"\",AG42=\"\",AD42=\"\",AC42=\"\",AB42=\"\",AA42=\"\",Z42=\"\",Y42=\"\",X42=\"\",W42=\"\",V42=\"\",U42=\"\",T42=\"\"),1,\"\")","v":""}]
[null,null,null,null,null,null,null,null,null,null,null,null,null,null,{"$f":"IF(T43=1,$T$3,IF(U43=1,$U$3,IF(V43=1,$V$3,IF(W43=1,W3,IF(X43=1,$X$3,IF(Y43=1,$Y$3,IF(Z43=1,$Z$3,IF(AA43=1,$AA$3,IF(AB43=1,$AB$3,IF(AC43=1,$AC$3,IF(AD43=1,$AD$3,IF(AE43=1,AE3,IF(AF43=1,$AF$3,IF(AG43=1,$AG$3,IF(AH43=1,$AH$3,\"\")))))))))))))))","v":""},null,null,null,"AM1",{"$f":"IF($S$43=T41,1,\"\")","v":""},{"$f":"IF(AND(U$41=$S$43,T43=\"\",U42=\"\"),1,\"\")","v":""},{"$f":"IF(AND(V$41=$S$43,U43=\"\",V42=\"\"),1,\"\")","v":""},{"$f":"IF(AND(W$41=$S$43,V43=\"\",W42=\"\"),1,\"\")","v":""},{"$f":"IF(AND(X$41=$S$43,X42=\"\",SUM($U$43:W43)=0),1,\"\")","v":""},{"$f":"IF(AND(Y$41=$S$43,Y42=\"\",SUM($U$43:X43)=0),1,\"\")","v":""},{"$f":"IF(AND(Z$41=$S$43,Z42=\"\",SUM($U$43:Y43)=0),1,\"\")","v":""},{"$f":"IF(AND(AA$41=$S$43,AA42=\"\",SUM($U$43:Z43)=0),1,\"\")","v":""},{"$f":"IF(AND(AB$41=$S$43,AB42=\"\",SUM($U$43:AA43)=0),1,\"\")","v":""},{"$f":"IF(AND(AC$41=$S$42,AC42=\"\",SUM($U$43:AB43)=0),1,\"\")","v":""},{"$f":"IF(AND(AD$41=$S$43,AD42=\"\",SUM($U$43:AC43)=0),1,\"\")","v":""},{"$f":"IF(AND(AE$41=$S$43,AE42=\"\",SUM($U$43:AD43)=0),1,\"\")","v":""},{"$f":"IF(AND(AF$41=$S$43,AF42=\"\",SUM($U$43:AE43)=0),1,\"\")","v":""},{"$f":"IF(AND(AG$41=$S$43,AG42=\"\",SUM($U$43:AF43)=0),1,\"\")","v":""},{"$f":"IF(AND(AH$41=$S$43,AH42=\"\",SUM($U$43:AG43)=0),1,\"\")","v":""}]
[null,null,null,null,null,null,null,null,null,null,null,null,null,null,{"$f":"IF(T44=1,$T$3,IF(U44=1,$U$3,IF(V44=1,$V$3,IF(W44=1,W3,IF(X44=1,$X$3,IF(Y44=1,$Y$3,IF(Z44=1,$Z$3,IF(AA44=1,$AA$3,IF(AB44=1,$AB$3,IF(AC44=1,$AC$3,IF(AD44=1,$AD$3,IF(AE44=1,AE3,IF(AF44=1,$AF$3,IF(AG44=1,$AG$3,IF(AH44=1,$AH$3,\"\")))))))))))))))","v":""},null,null,null,"AM2",{"$f":"IF($S$44=T41,1,\"\")","v":""},{"$f":"IF(AND($S$44=$U$41,T44=\"\"),1,\"\")","v":""},{"$f":"IF(AND($S$44=$V$41,U44=\"\",T44=\"\"),1,\"\")","v":""},{"$f":"IF(AND($S$44=W41,T44=\"\",U44=\"\",V44=\"\"),1,\"\")","v":""},{"$f":"IF(AND($S$44=X41,U44=\"\",V44=\"\",W44=\"\",T44=\"\"),1,\"\")","v":""},{"$f":"IF(AND($S$44=Y41,V44=\"\",W44=\"\",X44=\"\",U44=\"\",T44=\"\"),1,\"\")","v":""},{"$f":"IF(AND($S$44=Z41,W44=\"\",X44=\"\",Y44=\"\",V44=\"\",U44=\"\",T44=\"\"),1,\"\")","v":""},{"$f":"IF(AND($S$44=AA41,X44=\"\",Y44=\"\",Z44=\"\",W44=\"\",V44=\"\",U44=\"\",T44=\"\"),1,\"\")","v":""},{"$f":"IF(AND($S$44=AB41,Y44=\"\",Z44=\"\",AA44=\"\",X44=\"\",W44=\"\",V44=\"\",U44=\"\",T44=\"\"),1,\"\")","v":""},{"$f":"IF(AND($S$44=AC41,Z44=\"\",AA44=\"\",AB44=\"\",Y44=\"\",X44=\"\",W44=\"\",V44=\"\",U44=\"\",T44=\"\"),1,\"\")","v":""},{"$f":"IF(AND($S$44=AD41,AA44=\"\",AB44=\"\",AC44=\"\",Z44=\"\",Y44=\"\",X44=\"\",W44=\"\",V44=\"\",U44=\"\",T44=\"\"),1,\"\")","v":""},{"$f":"IF(AND($S$44=AE41,AB44=\"\",AC44=\"\",AD44=\"\",AA44=\"\",Z44=\"\",Y44=\"\",X44=\"\",W44=\"\",V44=\"\",U44=\"\",T44=\"\"),1,\"\")","v":""},{"$f":"IF(AND($S$44=AF41,AC44=\"\",AD44=\"\",AE44=\"\",AB44=\"\",AA44=\"\",Z44=\"\",Y44=\"\",X44=\"\",W44=\"\",V44=\"\",U44=\"\",T44=\"\"),1,\"\")","v":""},{"$f":"IF(AND($S$44=AG41,AD44=\"\",AE44=\"\",AF44=\"\",AC44=\"\",AB44=\"\",AA44=\"\",Z44=\"\",Y44=\"\",X44=\"\",W44=\"\",V44=\"\",U44=\"\",T44=\"\"),1,\"\")","v":""},{"$f":"IF(AND($S$44=AH41,AE44=\"\",AF44=\"\",AG44=\"\",AD44=\"\",AC44=\"\",AB44=\"\",AA44=\"\",Z44=\"\",Y44=\"\",X44=\"\",W44=\"\",V44=\"\",U44=\"\",T44=\"\"),1,\"\")","v":""},null,null,null,null,null,null,null,null,null,null,null,null,null,null,null,null,null,null,31]
[null,null,null,null,null,null,null,null,null,null,null,null,null,null,{"$f":"IF(T45=1,$T$3,IF(U45=1,$U$3,IF(V45=1,$V$3,IF(W45=1,W3,IF(X45=1,$X$3,IF(Y45=1,$Y$3,IF(Z45=1,$Z$3,IF(AA45=1,$AA$3,IF(AB45=1,$AB$3,IF(AC45=1,$AC$3,IF(AD45=1,$AD$3,IF(AE45=1,AE3,IF(AF45=1,$AF$3,IF(AG45=1,$AG$3,IF(AH45=1,$AH$3,\"\")))))))))))))))","v":""},null,null,null,"AM2",{"$f":"IF($S$45=T41,1,\"\")","v":""},{"$f":"IF(AND(U$41=$S$45,T45=\"\",U44=\"\"),1,\"\")","v":""},{"$f":"IF(AND(V$41=$S$45,U45=\"\",V44=\"\"),1,\"\")","v":""},{"$f":"IF(AND(W$41=$S$45,V45=\"\",W44=\"\"),1,\"\")","v":""},{"$f":"IF(AND(X$41=$S$45,X44=\"\",SUM($U$45:W45)=0),1,\"\")","v":""},{"$f":"IF(AND(Y$41=$S$45,Y44=\"\",SUM($U$45:X45)=0),1,\"\")","v":""},{"$f":"IF(AND(Z$41=$S$45,Z44=\"\",SUM($U$45:Y45)=0),1,\"\")","v":""},{"$f":"IF(AND(AA$41=$S$45,AA44=\"\",SUM($U$45:Z45)=0),1,\"\")","v":""},{"$f":"IF(AND(AB$41=$S$45,AB44=\"\",SUM($U$45:AA45)=0),1,\"\")","v":""},{"$f":"IF(AND(AC$41=$S$45,AC44=\"\",SUM($U$45:AB45)=0),1,\"\")","v":""},{"$f":"IF(AND(AD$41=$S$45,AD44=\"\",SUM($U$45:AC45)=0),1,\"\")","v":""},{"$f":"IF(AND(AE$41=$S$45,AE44=\"\",SUM($U$45:AD45)=0),1,\"\")","v":""},{"$f":"IF(AND(AF$41=$S$45,AF44=\"\",SUM($U$45:AE45)=0),1,\"\")","v":""},{"$f":"IF(AND(AG$41=$S$45,AG44=\"\",SUM($U$45:AF45)=0),1,\"\")","v":""},{"$f":"IF(AND(AH$41=$S$45,AH44=\"\",SUM($U$45:AG45)=0),1,\"\")","v":""}]
[null,null,null,null,null,null,null,null,null,null,null,null,null,null,{"$f":"IF(T46=1,$T$3,IF(U46=1,$U$3,IF(V46=1,$V$3,IF(W46=1,W3,IF(X46=1,$X$3,IF(Y46=1,$Y$3,IF(Z46=1,$Z$3,IF(AA46=1,$AA$3,IF(AB46=1,$AB$3,IF(AC46=1,$AC$3,IF(AD46=1,$AD$3,IF(AE46=1,AE3,IF(AF46=1,$AF$3,IF(AG46=1,$AG$3,IF(AH46=1,$AH$3,\"\")))))))))))))))","v":""},null,null,null,"AM3",{"$f":"IF($S$46=T41,1,\"\")","v":""},{"$f":"IF(AND($S$46=$U$41,T46=\"\"),1,\"\")","v":""},{"$f":"IF(AND($S$46=$V$41,U46=\"\",T46=\"\"),1,\"\")","v":""},{"$f":"IF(AND($S$46=W41,T46=\"\",U46=\"\",V46=\"\"),1,\"\")","v":""},{"$f":"IF(AND($S$46=X41,U46=\"\",V46=\"\",W46=\"\",T46=\"\"),1,\"\")","v":""},{"$f":"IF(AND($S$46=Y41,V46=\"\",W46=\"\",X46=\"\",U46=\"\",T46=\"\"),1,\"\")","v":""},{"$f":"IF(AND($S$46=Z41,W46=\"\",X46=\"\",Y46=\"\",V46=\"\",U46=\"\",T46=\"\"),1,\"\")","v":""},{"$f":"IF(AND($S$46=AA41,X46=\"\",Y46=\"\",Z46=\"\",W46=\"\",V46=\"\",U46=\"\",T46=\"\"),1,\"\")","v":""},{"$f":"IF(AND($S$46=AB41,Y46=\"\",Z46=\"\",AA46=\"\",X46=\"\",W46=\"\",V46=\"\",U46=\"\",T46=\"\"),1,\"\")","v":""},{"$f":"IF(AND($S$46=AC41,Z46=\"\",AA46=\"\",AB46=\"\",Y46=\"\",X46=\"\",W46=\"\",V46=\"\",U46=\"\",T46=\"\"),1,\"\")","v":""},{"$f":"IF(AND($S$46=AD41,AA46=\"\",AB46=\"\",AC46=\"\",Z46=\"\",Y46=\"\",X46=\"\",W46=\"\",V46=\"\",U46=\"\",T46=\"\"),1,\"\")","v":""},{"$f":"IF(AND($S$46=AE41,AB46=\"\",AC46=\"\",AD46=\"\",AA46=\"\",Z46=\"\",Y46=\"\",X46=\"\",W46=\"\",V46=\"\",U46=\"\",T46=\"\"),1,\"\")","v":""},{"$f":"IF(AND($S$46=AF41,AC46=\"\",AD46=\"\",AE46=\"\",AB46=\"\",AA46=\"\",Z46=\"\",Y46=\"\",X46=\"\",W46=\"\",V46=\"\",U46=\"\",T46=\"\"),1,\"\")","v":""},{"$f":"IF(AND($S$46=AG41,AD46=\"\",AE46=\"\",AF46=\"\",AC46=\"\",AB46=\"\",AA46=\"\",Z46=\"\",Y46=\"\",X46=\"\",W46=\"\",V46=\"\",U46=\"\",T46=\"\"),1,\"\")","v":""},{"$f":"IF(AND($S$46=AH41,AE46=\"\",AF46=\"\",AG46=\"\",AD46=\"\",AC46=\"\",AB46=\"\",AA46=\"\",Z46=\"\",Y46=\"\",X46=\"\",W46=\"\",V46=\"\",U46=\"\",T46=\"\"),1,\"\")","v":""}]
[null,null,null,null,null,null,null,null,null,null,null,null,null,null,{"$f":"IF(T47=1,$T$3,IF(U47=1,$U$3,IF(V47=1,$V$3,IF(W47=1,W3,IF(X47=1,$X$3,IF(Y47=1,$Y$3,IF(Z47=1,$Z$3,IF(AA47=1,$AA$3,IF(AB47=1,$AB$3,IF(AC47=1,$AC$3,IF(AD47=1,$AD$3,IF(AE47=1,AE3,IF(AF47=1,$AF$3,IF(AG47=1,$AG$3,IF(AH47=1,$AH$3,\"\")))))))))))))))","v":""},null,null,null,"AM3",{"$f":"IF($S$47=T41,1,\"\")","v":""},{"$f":"IF(AND(U$41=$S$47,T47=\"\",U46=\"\"),1,\"\")","v":""},{"$f":"IF(AND(V$41=$S$47,U47=\"\",V46=\"\"),1,\"\")","v":""},{"$f":"IF(AND(W$41=$S$47,V47=\"\",W46=\"\"),1,\"\")","v":""},{"$f":"IF(AND(X$41=$S$47,X46=\"\",SUM($U$47:W47)=0),1,\"\")","v":""},{"$f":"IF(AND(Y$41=$S$47,Y46=\"\",SUM($U$47:X47)=0),1,\"\")","v":""},{"$f":"IF(AND(Z$41=$S$47,Z46=\"\",SUM($U$47:Y47)=0),1,\"\")","v":""},{"$f":"IF(AND(AA$41=$S$47,AA46=\"\",SUM($U$47:Z47)=0),1,\"\")","v":""},{"$f":"IF(AND(AB$41=$S$47,AB46=\"\",SUM($U$47:AA47)=0),1,\"\")","v":""},{"$f":"IF(AND(AC$41=$S$47,AC46=\"\",SUM($U$47:AB47)=0),1,\"\")","v":""},{"$f":"IF(AND(AD$41=$S$47,AD46=\"\",SUM($U$47:AC47)=0),1,\"\")","v":""},{"$f":"IF(AND(AE$41=$S$47,AE46=\"\",SUM($U$47:AD47)=0),1,\"\")","v":""},{"$f":"IF(AND(AF$41=$S$47,AF46=\"\",SUM($U$47:AE47)=0),1,\"\")","v":""},{"$f":"IF(AND(AG$41=$S$47,AG46=\"\",SUM($U$47:AF47)=0),1,\"\")","v":""},{"$f":"IF(AND(AH$41=$S$47,AH46=\"\",SUM($U$47:AG47)=0),1,\"\")","v":""}]
[null,null,null,null,null,null,null,null,null,null,null,null,null,null,{"$f":"IF(T48=1,$T$3,IF(U48=1,$U$3,IF(V48=1,$V$3,IF(W48=1,W18,IF(X48=1,$X$3,IF(Y48=1,$Y$3,IF(Z48=1,$Z$3,IF(AA48=1,$AA$3,IF(AB48=1,$AB$3,IF(AC48=1,$AC$3,IF(AD48=1,$AD$3,IF(AE48=1,AE18,IF(AF48=1,$AF$3,IF(AG48=1,$AG$3,IF(AH48=1,$AH$3,\"\")))))))))))))))","v":""}]
[null,null,null,null,null,null,null,null,null,null,null,null,null,null,null,null,null,null,null,null,null,null,null,null,null,null,null,null,null,null,null,null,null,null,null,null,null,null,null,null,null,null,null,null,null,null,null,null,null,null,null,null,35]
[null,null,null,null,null,null,null,null,null,null,null,null,null,null,{"$f":"IF(T50=1,$T$3,IF(U50=1,$U$3,IF(V50=1,$V$3,IF(W50=1,W3,IF(X50=1,$X$3,IF(Y50=1,$Y$3,IF(Z50=1,$Z$3,IF(AA50=1,$AA$3,IF(AB50=1,$AB$3,IF(AC50=1,$AC$3,IF(AD50=1,$AD$3,IF(AE50=1,AE12,IF(AF50=1,$AF$3,IF(AG50=1,$AG$3,IF(AH50=1,$AH$3,\"\")))))))))))))))","v":""},{"$f":"IF(R50=1,R$9,IF(S50=1,S$9,IF(T50=1,T$9,IF(U50=1,U$9,IF(V50=1,V$9,IF(W50=1,W$9,IF(X50=1,X$9,IF(Y50=1,Y$9,IF(Z50=1,Z$9,IF(AA50=1,AA$9,IF(AB50=1,AB$9,\"\")))))))))))","v":""},"Début",null,"AM2",{"$f":"IF($S$50=$T$32,1,\"\")","v":""},{"$f":"IF(AND($S$50=$U$32,T50=\"\"),1,\"\")","v":""},{"$f":"IF(AND($S$50=$V$32,U50=\"\",T50=\"\"),1,\"\")","v":""},{"$f":"IF(AND($S$50=W32,T50=\"\",U50=\"\",V50=\"\"),1,\"\")","v":""},{"$f":"IF(AND($S$50=$X$32,U50=\"\",V50=\"\",W50=\"\",T50=\"\"),1,\"\")","v":""},{"$f":"IF(AND($S$50=$Y$32,V50=\"\",W50=\"\",X50=\"\",U50=\"\",T50=\"\"),1,\"\")","v":""},{"$f":"IF(AND($S$50=Z32,W50=\"\",X50=\"\",Y50=\"\",V50=\"\",U50=\"\",T50=\"\"),1,\"\")","v":""},{"$f":"IF(AND($S$50=AA32,X50=\"\",Y50=\"\",Z50=\"\",W50=\"\",V50=\"\",U50=\"\",T50=\"\"),1,\"\")","v":""},{"$f":"IF(AND($S$50=$AB$32,Y50=\"\",Z50=\"\",AA50=\"\",X50=\"\",W50=\"\",V50=\"\",U50=\"\",T50=\"\"),1,\"\")","v":""},{"$f":"IF(AND($S$50=$AC$32,Z50=\"\",AA50=\"\",AB50=\"\",Y50=\"\",X50=\"\",W50=\"\",V50=\"\",U50=\"\",T50=\"\"),1,\"\")","v":""},{"$f":"IF(AND($S$50=$AD$32,AA50=\"\",AB50=\"\",AC50=\"\",Z50=\"\",Y50=\"\",X50=\"\",W50=\"\",V50=\"\",U50=\"\",T50=\"\"),1,\"\")","v":""},{"$f":"IF(AND($S$50=$AE$32,AB50=\"\",AC50=\"\",AD50=\"\",AA50=\"\",Z50=\"\",Y50=\"\",X50=\"\",W50=\"\",V50=\"\",U50=\"\",T50=\"\"),1,\"\")","v":""},{"$f":"IF(AND($S$50=$AF$32,AC50=\"\",AD50=\"\",AE50=\"\",AB50=\"\",AA50=\"\",Z50=\"\",Y50=\"\",X50=\"\",W50=\"\",V50=\"\",U50=\"\",T50=\"\"),1,\"\")","v":""},{"$f":"IF(AND($S$50=$AG$32,AD50=\"\",AE50=\"\",AF50=\"\",AC50=\"\",AB50=\"\",AA50=\"\",Z50=\"\",Y50=\"\",X50=\"\",W50=\"\",V50=\"\",U50=\"\",T50=\"\"),1,\"\")","v":""},{"$f":"IF(AND($S$50=$AH$32,AE50=\"\",AF50=\"\",AG50=\"\",AD50=\"\",AC50=\"\",AB50=\"\",AA50=\"\",Z50=\"\",Y50=\"\",X50=\"\",W50=\"\",V50=\"\",U50=\"\",T50=\"\"),1,\"\")","v":""},null,null,null,null,null,null,null,null,null,null,null,null,null,null,null,null,null,null,36]
[null,null,null,null,null,null,null,null,null,null,null,null,null,null,{"$f":"IF(T51=1,$T$3,IF(U51=1,$U$3,IF(V51=1,$V$3,IF(W51=1,$W$3,IF(X51=1,$X$3,IF(Y51=1,$Y$3,IF(Z51=1,$Z$3,IF(AA51=1,$AA$3,IF(AB51=1,$AB$3,IF(AC51=1,$AC$3,IF(AD51=1,$AD$3,IF(AE51=1,$AE$3,IF(AF51=1,$AF$3,IF(AG51=1,$AG$3,IF(AH51=1,$AH$3,\"\")))))))))))))))","v":""},{"$f":"IF(R51=1,R$9,IF(S51=1,S$9,IF(T51=1,T$9,IF(U51=1,U$9,IF(V51=1,V$9,IF(W51=1,W$9,IF(X51=1,X$9,IF(Y51=1,Y$9,IF(Z51=1,Z$9,IF(AA51=1,AA$9,IF(AB51=1,AB$9,\"\")))))))))))","v":""},null,null,"AM2",null,{"$f":"IF(AND(U$32=$S$51,T51=\"\",U50=\"\"),1,\"\")","v":""},{"$f":"IF(AND(V$32=$S$51,U51=\"\",V50=\"\"),1,\"\")","v":""},{"$f":"IF(AND(W$32=$S$51,V51=\"\",W50=\"\"),1,\"\")","v":""},{"$f":"IF(AND(X$32=$S$51,X50=\"\",SUM($U$51:W51)=0),1,\"\")","v":""},{"$f":"IF(AND(Y$32=$S$51,Y50=\"\",SUM($U$51:X51)=0),1,\"\")","v":""},{"$f":"IF(AND(Z$32=$S$51,Z50=\"\",SUM($U$51:Y51)=0),1,\"\")","v":""},{"$f":"IF(AND(AA$32=$S$51,AA50=\"\",SUM($U$51:Z51)=0),1,\"\")","v":""},{"$f":"IF(AND(AB$32=$S$51,AB50=\"\",SUM($U$51:AA51)=0),1,\"\")","v":""},{"$f":"IF(AND(AC$32=$S$51,AC50=\"\",SUM($U$51:AB51)=0),1,\"\")","v":""},{"$f":"IF(AND(AD$32=$S$51,AD50=\"\",SUM($U$51:AC51)=0),1,\"\")","v":""},{"$f":"IF(AND(AE$32=$S$51,AE50=\"\",SUM($U$51:AD51)=0),1,\"\")","v":""},{"$f":"IF(AND(AF$32=$S$51,AF50=\"\",SUM($U$51:AE51)=0),1,\"\")","v":""},{"$f":"IF(AND(AG$32=$S$51,AG50=\"\",SUM($U$51:AF51)=0),1,\"\")","v":""},{"$f":"IF(AND(AH$32=$S$51,AH50=\"\",SUM($U$51:AG51)=0),1,\"\")","v":""},null,null,null,null,null,null,null,null,null,null,null,null,null,null,null,null,null,null,37]
[null,null,null,null,null,null,null,null,null,null,null,null,null,null,{"$f":"IF(T52=1,$T$3,IF(U52=1,$U$3,IF(V52=1,$V$3,IF(W52=1,W10,IF(X52=1,$X$3,IF(Y52=1,$Y$3,IF(Z52=1,$Z$3,IF(AA52=1,$AA$3,IF(AB52=1,$AB$3,IF(AC52=1,$AC$3,IF(AD52=1,$AD$3,IF(AE52=1,$AE$3,IF(AF52=1,$AF$3,IF(AG52=1,$AG$3,IF(AH52=1,$AH$3,\"\")))))))))))))))","v":""},"",null,null,"AM2",null,null,{"$f":"IF(AND(V$32=S52,U52=\"\",V51=\"\",V50=\"\"),1,\"\")","v":""},{"$f":"IF(AND(W$32=S52,V52=\"\",W51=\"\",W50=\"\"),1,\"\")","v":""},{"$f":"IF(AND(X$32=$S$52,X50=\"\",X51=\"\",SUM($V$52:W52)=0),1,\"\")","v":""},{"$f":"IF(AND(Y$32=$S$52,Y50=\"\",Y51=\"\",SUM($V$52:X52)=0),1,\"\")","v":""},{"$f":"IF(AND(Z$32=$S$52,Z50=\"\",Z51=\"\",SUM($V$52:Y52)=0),1,\"\")","v":""},{"$f":"IF(AND(AA$32=$S$52,AA50=\"\",AA51=\"\",SUM($V$52:Z52)=0),1,\"\")","v":""},{"$f":"IF(AND(AB$32=$S$52,AB50=\"\",AB51=\"\",SUM($V$52:AA52)=0),1,\"\")","v":""},{"$f":"IF(AND(AC$32=$S$52,AC50=\"\",AC51=\"\",SUM($V$52:AB52)=0),1,\"\")","v":""},{"$f":"IF(AND(AD$32=$S$52,AD50=\"\",AD51=\"\",SUM($V$52:AC52)=0),1,\"\")","v":""},{"$f":"IF(AND(AE$32=$S$52,AE50=\"\",AE51=\"\",SUM($V$52:AD52)=0),1,\"\")","v":""},{"$f":"IF(AND(AF$32=$S$52,AF50=\"\",AF51=\"\",SUM($V$52:AE52)=0),1,\"\")","v":""},{"$f":"IF(AND(AG$32=$S$52,AG50=\"\",AG51=\"\",SUM($V$52:AF52)=0),1,\"\")","v":""},{"$f":"IF(AND(AH$32=$S$52,AH50=\"\",AH51=\"\",SUM($V$52:AG52)=0),1,\"\")","v":""},null,null,null,null,null,null,null,null,null,null,null,null,null,null,null,null,null,null,38]
[null,null,null,null,null,null,null,null,null,null,null,null,null,null,null,null,null,null,null,null,null,null,null,null,null,null,null,null,null,null,null,null,null,null,null,null,null,null,null,null,null,null,null,null,null,null,null,null,null,null,null,null,39]
[null,null,null,null,null,null,null,null,null,null,null,null,null,null,null,null,null,null,null,null,null,null,null,null,null,null,null,null,null,null,null,null,null,null,null,null,null,null,null,null,null,null,null,null,null,null,null,null,null,null,null,null,40]
[null,null,null,null,null,null,null,null,null,null,null,null,null,null,{"$f":"IF(T55=1,$T$3,IF(U55=1,$U$3,IF(V55=1,$V$3,IF(W55=1,W8,IF(X55=1,$X$3,IF(Y55=1,$Y$3,IF(Z55=1,$Z$3,IF(AA55=1,$AA$3,IF(AB55=1,$AB$3,IF(AC55=1,$AC$3,IF(AD55=1,$AD$3,IF(AE55=1,AE17,IF(AF55=1,$AF$3,IF(AG55=1,$AG$3,IF(AH55=1,$AH$3,\"\")))))))))))))))","v":""},{"$f":"IF(R55=1,R$9,IF(S55=1,S$9,IF(T55=1,T$9,IF(U55=1,U$9,IF(V55=1,V$9,IF(W55=1,W$9,IF(X55=1,X$9,IF(Y55=1,Y$9,IF(Z55=1,Z$9,IF(AA55=1,AA$9,IF(AB55=1,AB$9,\"\")))))))))))","v":""},"Matin",null,"AM3",{"$f":"IF($S$55=$T$32,1,\"\")","v":""},{"$f":"IF(AND($S$55=$U$32,T55=\"\"),1,\"\")","v":""},{"$f":"IF(AND($S$55=$V$32,U55=\"\",T55=\"\"),1,\"\")","v":""},{"$f":"IF(AND($S$55=W37,T55=\"\",U55=\"\",V55=\"\"),1,\"\")","v":""},{"$f":"IF(AND($S$55=$X$32,U55=\"\",V55=\"\",W55=\"\",T55=\"\"),1,\"\")","v":""},{"$f":"IF(AND($S$55=$Y$32,V55=\"\",W55=\"\",X55=\"\",U55=\"\",T55=\"\"),1,\"\")","v":""},{"$f":"IF(AND($S$55=Z37,W55=\"\",X55=\"\",Y55=\"\",V55=\"\",U55=\"\",T55=\"\"),1,\"\")","v":""},{"$f":"IF(AND($S$55=AA37,X55=\"\",Y55=\"\",Z55=\"\",W55=\"\",V55=\"\",U55=\"\",T55=\"\"),1,\"\")","v":""},{"$f":"IF(AND($S$55=$AB$32,Y55=\"\",Z55=\"\",AA55=\"\",X55=\"\",W55=\"\",V55=\"\",U55=\"\",T55=\"\"),1,\"\")","v":""},{"$f":"IF(AND($S$55=$AC$32,Z55=\"\",AA55=\"\",AB55=\"\",Y55=\"\",X55=\"\",W55=\"\",V55=\"\",U55=\"\",T55=\"\"),1,\"\")","v":""},{"$f":"IF(AND($S$55=$AD$32,AA55=\"\",AB55=\"\",AC55=\"\",Z55=\"\",Y55=\"\",X55=\"\",W55=\"\",V55=\"\",U55=\"\",T55=\"\"),1,\"\")","v":""},{"$f":"IF(AND($S$55=$AE$32,AB55=\"\",AC55=\"\",AD55=\"\",AA55=\"\",Z55=\"\",Y55=\"\",X55=\"\",W55=\"\",V55=\"\",U55=\"\",T55=\"\"),1,\"\")","v":""},{"$f":"IF(AND($S$55=$AF$32,AC55=\"\",AD55=\"\",AE55=\"\",AB55=\"\",AA55=\"\",Z55=\"\",Y55=\"\",X55=\"\",W55=\"\",V55=\"\",U55=\"\",T55=\"\"),1,\"\")","v":""},{"$f":"IF(AND($S$55=$AG$32,AD55=\"\",AE55=\"\",AF55=\"\",AC55=\"\",AB55=\"\",AA55=\"\",Z55=\"\",Y55=\"\",X55=\"\",W55=\"\",V55=\"\",U55=\"\",T55=\"\"),1,\"\")","v":""},{"$f":"IF(AND($S$55=$AH$32,AE55=\"\",AF55=\"\",AG55=\"\",AD55=\"\",AC55=\"\",AB55=\"\",AA55=\"\",Z55=\"\",Y55=\"\",X55=\"\",W55=\"\",V55=\"\",U55=\"\",T55=\"\"),1,\"\")","v":""},null,null,null,null,null,null,null,null,null,null,null,null,null,null,null,null,null,null,41]
[null,null,null,null,null,null,null,null,null,null,null,null,null,null,{"$f":"IF(T56=1,$T$3,IF(U56=1,$U$3,IF(V56=1,$V$3,IF(W56=1,$W$3,IF(X56=1,$X$3,IF(Y56=1,$Y$3,IF(Z56=1,$Z$3,IF(AA56=1,$AA$3,IF(AB56=1,$AB$3,IF(AC56=1,$AC$3,IF(AD56=1,$AD$3,IF(AE56=1,$AE$3,IF(AF56=1,$AF$3,IF(AG56=1,$AG$3,IF(AH56=1,$AH$3,\"\")))))))))))))))","v":""},{"$f":"IF(R56=1,R$9,IF(S56=1,S$9,IF(T56=1,T$9,IF(U56=1,U$9,IF(V56=1,V$9,IF(W56=1,W$9,IF(X56=1,X$9,IF(Y56=1,Y$9,IF(Z56=1,Z$9,IF(AA56=1,AA$9,IF(AB56=1,AB$9,\"\")))))))))))","v":""},null,null,"AM3",null,{"$f":"IF(AND(U$32=$S$56,T56=\"\",U55=\"\"),1,\"\")","v":""},{"$f":"IF(AND(V$32=$S$56,U56=\"\",V55=\"\"),1,\"\")","v":""},{"$f":"IF(AND(W$32=$S$56,V56=\"\",W55=\"\"),1,\"\")","v":""},{"$f":"IF(AND(X$32=$S$56,X55=\"\",SUM($U$56:W56)=0),1,\"\")","v":""},{"$f":"IF(AND(Y$32=$S$56,Y55=\"\",SUM($U$56:X56)=0),1,\"\")","v":""},{"$f":"IF(AND(Z$32=$S$56,Z55=\"\",SUM($U$56:Y56)=0),1,\"\")","v":""},{"$f":"IF(AND(AA$32=$S$56,AA55=\"\",SUM($U$56:Z56)=0),1,\"\")","v":""},{"$f":"IF(AND(AB$32=$S$56,AB55=\"\",SUM($U$56:AA56)=0),1,\"\")","v":""},{"$f":"IF(AND(AC$32=$S$56,AC55=\"\",SUM($U$56:AB56)=0),1,\"\")","v":""},{"$f":"IF(AND(AD$32=$S$56,AD55=\"\",SUM($U$56:AC56)=0),1,\"\")","v":""},{"$f":"IF(AND(AE$32=$S$56,AE55=\"\",SUM($U$56:AD56)=0),1,\"\")","v":""},{"$f":"IF(AND(AF$32=$S$56,AF55=\"\",SUM($U$56:AE56)=0),1,\"\")","v":""},{"$f":"IF(AND(AG$32=$S$56,AG55=\"\",SUM($U$56:AF56)=0),1,\"\")","v":""},{"$f":"IF(AND(AH$32=$S$56,AH55=\"\",SUM($U$56:AG56)=0),1,\"\")","v":""},null,null,null,null,null,null,null,null,null,null,null,null,null,null,null,null,null,null,42]
[null,null,null,null,null,null,null,null,null,null,null,null,null,null,{"$f":"IF(T57=1,$T$3,IF(U57=1,$U$3,IF(V57=1,$V$3,IF(W57=1,$W$3,IF(X57=1,$X$3,IF(Y57=1,$Y$3,IF(Z57=1,$Z$3,IF(AA57=1,$AA$3,IF(AB57=1,$AB$3,IF(AC57=1,$AC$3,IF(AD57=1,$AD$3,IF(AE57=1,$AE$3,IF(AF57=1,$AF$3,IF(AG57=1,$AG$3,IF(AH57=1,$AH$3,\"\")))))))))))))))","v":""},"",null,null,"AM3",null,null,{"$f":"IF(AND(V$32=S57,U57=\"\",V56=\"\",V55=\"\"),1,\"\")","v":""},{"$f":"IF(AND(W$32=S57,V57=\"\",W56=\"\",W55=\"\"),1,\"\")","v":""},{"$f":"IF(AND(X$32=$S$57,X55=\"\",X56=\"\",SUM($V$57:W57)=0),1,\"\")","v":""},{"$f":"IF(AND(Y$32=$S$57,Y55=\"\",Y56=\"\",SUM($V$57:X57)=0),1,\"\")","v":""},{"$f":"IF(AND(Z$32=$S$57,Z55=\"\",Z56=\"\",SUM($V$57:Y57)=0),1,\"\")","v":""},{"$f":"IF(AND(AA$32=$S$57,AA55=\"\",AA56=\"\",SUM($V$57:Z57)=0),1,\"\")","v":""},{"$f":"IF(AND(AB$32=$S$57,AB55=\"\",AB56=\"\",SUM($V$57:AA57)=0),1,\"\")","v":""},{"$f":"IF(AND(AC$32=$S$57,AC55=\"\",AC56=\"\",SUM($V$57:AB57)=0),1,\"\")","v":""},{"$f":"IF(AND(AD$32=$S$57,AD55=\"\",AD56=\"\",SUM($V$57:AC57)=0),1,\"\")","v":""},{"$f":"IF(AND(AE$32=$S$57,AE55=\"\",AE56=\"\",SUM($V$57:AD57)=0),1,\"\")","v":""},{"$f":"IF(AND(AF$32=$S$57,AF55=\"\",AF56=\"\",SUM($V$57:AE57)=0),1,\"\")","v":""},{"$f":"IF(AND(AG$32=$S$57,AG55=\"\",AG56=\"\",SUM($V$57:AF57)=0),1,\"\")","v":""},{"$f":"IF(AND(AH$32=$S$57,AH55=\"\",AH56=\"\",SUM($V$57:AG57)=0),1,\"\")","v":""},null,null,null,null,null,null,null,null,null,null,null,null,null,null,null,null,null,null,43]
[null,null,null,null,null,null,null,null,null,null,null,null,null,null,null,null,null,null,null,null,null,null,null,null,null,null,null,null,null,null,null,null,null,null,null,null,null,null,null,null,null,null,null,null,null,null,null,null,null,null,null,null,44]
[null,null,null,null,null,null,null,null,null,null,null,null,null,null,null,null,null,null,null,null,null,null,null,null,null,null,null,null,null,null,null,null,null,null,null,null,null,null,null,null,null,null,null,null,null,null,null,null,null,null,null,null,45]
[null,null,null,null,null,null,null,null,null,null,null,null,null,null,{"$f":"IF(T60=1,$T$3,IF(U60=1,$U$3,IF(V60=1,$V$3,IF(W60=1,$W$3,IF(X60=1,$X$3,IF(Y60=1,$Y$3,IF(Z60=1,$Z$3,IF(AA60=1,$AA$3,IF(AB60=1,$AB$3,IF(AC60=1,$AC$3,IF(AD60=1,$AD$3,IF(AE60=1,$AE$3,IF(AF60=1,$AF$3,IF(AG60=1,$AG$3,IF(AH60=1,$AH$3,\"\")))))))))))))))","v":""},{"$f":"IF(R60=1,R$9,IF(S60=1,S$9,IF(T60=1,T$9,IF(U60=1,U$9,IF(V60=1,V$9,IF(W60=1,W$9,IF(X60=1,X$9,IF(Y60=1,Y$9,IF(Z60=1,Z$9,IF(AA60=1,AA$9,IF(AB60=1,AB$9,\"\")))))))))))","v":""},"Matin",null,"M",{"$f":"IF($S$60=$T$32,1,\"\")","v":""},{"$f":"IF(AND($S$60=$U$32,T60=\"\"),1,\"\")","v":""},{"$f":"IF(AND($S$60=$V$32,U60=\"\",T60=\"\"),1,\"\")","v":""},{"$f":"IF(AND($S$60=W50,T60=\"\",U60=\"\",V60=\"\"),1,\"\")","v":""},{"$f":"IF(AND($S$60=$X$32,U60=\"\",V60=\"\",W60=\"\",T60=\"\"),1,\"\")","v":""},{"$f":"IF(AND($S$60=$Y$32,V60=\"\",W60=\"\",X60=\"\",U60=\"\",T60=\"\"),1,\"\")","v":""},{"$f":"IF(AND($S$60=Z50,W60=\"\",X60=\"\",Y60=\"\",V60=\"\",U60=\"\",T60=\"\"),1,\"\")","v":""},{"$f":"IF(AND($S$60=AA50,X60=\"\",Y60=\"\",Z60=\"\",W60=\"\",V60=\"\",U60=\"\",T60=\"\"),1,\"\")","v":""},{"$f":"IF(AND($S$60=$AB$32,Y60=\"\",Z60=\"\",AA60=\"\",X60=\"\",W60=\"\",V60=\"\",U60=\"\",T60=\"\"),1,\"\")","v":""},{"$f":"IF(AND($S$60=$AC$32,Z60=\"\",AA60=\"\",AB60=\"\",Y60=\"\",X60=\"\",W60=\"\",V60=\"\",U60=\"\",T60=\"\"),1,\"\")","v":""},{"$f":"IF(AND($S$60=$AD$32,AA60=\"\",AB60=\"\",AC60=\"\",Z60=\"\",Y60=\"\",X60=\"\",W60=\"\",V60=\"\",U60=\"\",T60=\"\"),1,\"\")","v":""},{"$f":"IF(AND($S$60=$AE$32,AB60=\"\",AC60=\"\",AD60=\"\",AA60=\"\",Z60=\"\",Y60=\"\",X60=\"\",W60=\"\",V60=\"\",U60=\"\",T60=\"\"),1,\"\")","v":""},{"$f":"IF(AND($S$60=$AF$32,AC60=\"\",AD60=\"\",AE60=\"\",AB60=\"\",AA60=\"\",Z60=\"\",Y60=\"\",X60=\"\",W60=\"\",V60=\"\",U60=\"\",T60=\"\"),1,\"\")","v":""},{"$f":"IF(AND($S$60=$AG$32,AD60=\"\",AE60=\"\",AF60=\"\",AC60=\"\",AB60=\"\",AA60=\"\",Z60=\"\",Y60=\"\",X60=\"\",W60=\"\",V60=\"\",U60=\"\",T60=\"\"),1,\"\")","v":""},{"$f":"IF(AND($S$60=$AH$32,AE60=\"\",AF60=\"\",AG60=\"\",AD60=\"\",AC60=\"\",AB60=\"\",AA60=\"\",Z60=\"\",Y60=\"\",X60=\"\",W60=\"\",V60=\"\",U60=\"\",T60=\"\"),1,\"\")","v":""},null,null,null,null,null,null,null,null,null,null,null,null,null,null,null,null,null,null,46]
[null,null,null,null,null,null,null,null,null,null,null,null,null,null,{"$f":"IF(T61=1,$T$3,IF(U61=1,$U$3,IF(V61=1,$V$3,IF(W61=1,$W$3,IF(X61=1,$X$3,IF(Y61=1,$Y$3,IF(Z61=1,$Z$3,IF(AA61=1,$AA$3,IF(AB61=1,$AB$3,IF(AC61=1,$AC$3,IF(AD61=1,$AD$3,IF(AE61=1,$AE$3,IF(AF61=1,$AF$3,IF(AG61=1,$AG$3,IF(AH61=1,$AH$3,\"\")))))))))))))))","v":""},{"$f":"IF(R61=1,R$9,IF(S61=1,S$9,IF(T61=1,T$9,IF(U61=1,U$9,IF(V61=1,V$9,IF(W61=1,W$9,IF(X61=1,X$9,IF(Y61=1,Y$9,IF(Z61=1,Z$9,IF(AA61=1,AA$9,IF(AB61=1,AB$9,\"\")))))))))))","v":""},null,null,"M",null,{"$f":"IF(AND(U$32=$S$61,T61=\"\",U60=\"\"),1,\"\")","v":""},{"$f":"IF(AND(V$32=$S$61,U61=\"\",V60=\"\"),1,\"\")","v":""},{"$f":"IF(AND(W$32=$S$61,V61=\"\",W60=\"\"),1,\"\")","v":""},{"$f":"IF(AND(X$32=$S$61,X60=\"\",SUM($U$61:W61)=0),1,\"\")","v":""},{"$f":"IF(AND(Y$32=$S$61,Y60=\"\",SUM($U$61:X61)=0),1,\"\")","v":""},{"$f":"IF(AND(Z$32=$S$61,Z60=\"\",SUM($U$61:Y61)=0),1,\"\")","v":""},{"$f":"IF(AND(AA$32=$S$61,AA60=\"\",SUM($U$61:Z61)=0),1,\"\")","v":""},{"$f":"IF(AND(AB$32=$S$61,AB60=\"\",SUM($U$61:AA61)=0),1,\"\")","v":""},{"$f":"IF(AND(AC$32=$S$61,AC60=\"\",SUM($U$61:AB61)=0),1,\"\")","v":""},{"$f":"IF(AND(AD$32=$S$61,AD60=\"\",SUM($U$61:AC61)=0),1,\"\")","v":""},{"$f":"IF(AND(AE$32=$S$61,AE60=\"\",SUM($U$61:AD61)=0),1,\"\")","v":""},{"$f":"IF(AND(AF$32=$S$61,AF60=\"\",SUM($U$61:AE61)=0),1,\"\")","v":""},{"$f":"IF(AND(AG$32=$S$61,AG60=\"\",SUM($U$61:AF61)=0),1,\"\")","v":""},{"$f":"IF(AND(AH$32=$S$61,AH60=\"\",SUM($U$61:AG61)=0),1,\"\")","v":""},null,null,null,null,null,null,null,null,null,null,null,null,null,null,null,null,null,null,47]
[null,null,null,null,null,null,null,null,null,null,null,null,null,null,{"$f":"IF(T62=1,$T$3,IF(U62=1,$U$3,IF(V62=1,$V$3,IF(W62=1,$W$3,IF(X62=1,$X$3,IF(Y62=1,$Y$3,IF(Z62=1,$Z$3,IF(AA62=1,$AA$3,IF(AB62=1,$AB$3,IF(AC62=1,$AC$3,IF(AD62=1,$AD$3,IF(AE62=1,$AE$3,IF(AF62=1,$AF$3,IF(AG62=1,$AG$3,IF(AH62=1,$AH$3,\"\")))))))))))))))","v":""},"",null,null,"M",null,null,{"$f":"IF(AND(V$32=S62,U62=\"\",V61=\"\",V60=\"\"),1,\"\")","v":""},{"$f":"IF(AND(W$32=S62,V62=\"\",W61=\"\",W60=\"\"),1,\"\")","v":""},{"$f":"IF(AND(X$32=$S$62,X60=\"\",X61=\"\",SUM($V$62:W62)=0),1,\"\")","v":""},{"$f":"IF(AND(Y$32=$S$62,Y60=\"\",Y61=\"\",SUM($V$62:X62)=0),1,\"\")","v":""},{"$f":"IF(AND(Z$32=$S$62,Z60=\"\",Z61=\"\",SUM($V$62:Y62)=0),1,\"\")","v":""},{"$f":"IF(AND(AA$32=$S$62,AA60=\"\",AA61=\"\",SUM($V$62:Z62)=0),1,\"\")","v":""},{"$f":"IF(AND(AB$32=$S$62,AB60=\"\",AB61=\"\",SUM($V$62:AA62)=0),1,\"\")","v":""},{"$f":"IF(AND(AC$32=$S$62,AC60=\"\",AC61=\"\",SUM($V$62:AB62)=0),1,\"\")","v":""},{"$f":"IF(AND(AD$32=$S$62,AD60=\"\",AD61=\"\",SUM($V$62:AC62)=0),1,\"\")","v":""},{"$f":"IF(AND(AE$32=$S$62,AE60=\"\",AE61=\"\",SUM($V$62:AD62)=0),1,\"\")","v":""},{"$f":"IF(AND(AF$32=$S$62,AF60=\"\",AF61=\"\",SUM($V$62:AE62)=0),1,\"\")","v":""},{"$f":"IF(AND(AG$32=$S$62,AG60=\"\",AG61=\"\",SUM($V$62:AF62)=0),1,\"\")","v":""},{"$f":"IF(AND(AH$32=$S$62,AH60=\"\",AH61=\"\",SUM($V$62:AG62)=0),1,\"\")","v":""},null,null,null,null,null,null,null,null,null,null,null,null,null,null,null,null,null,null,48]
[null,null,null,null,null,null,null,null,null,null,null,null,null,null,null,null,null,null,null,null,null,null,null,null,null,null,null,null,null,null,null,null,null,null,null,null,null,null,null,null,null,null,null,null,null,null,null,null,null,null,null,null,49]
[null,null,null,null,null,null,null,null,null,null,null,null,null,null,null,null,null,null,null,null,null,null,null,null,null,null,null,null,null,null,null,null,null,null,null,null,null,null,null,null,null,null,null,null,null,null,null,null,null,null,null,null,50]
[null,null,null,null,null,null,null,null,null,null,null,null,null,null,{"$f":"IF(T65=1,$T$3,IF(U65=1,$U$3,IF(V65=1,$V$3,IF(W65=1,$W$3,IF(X65=1,$X$3,IF(Y65=1,$Y$3,IF(Z65=1,$Z$3,IF(AA65=1,$AA$3,IF(AB65=1,$AB$3,IF(AC65=1,$AC$3,IF(AD65=1,$AD$3,IF(AE65=1,$AE$3,IF(AF65=1,$AF$3,IF(AG65=1,$AG$3,IF(AH65=1,$AH$3,\"\")))))))))))))))","v":""},{"$f":"IF(R65=1,R$9,IF(S65=1,S$9,IF(T65=1,T$9,IF(U65=1,U$9,IF(V65=1,V$9,IF(W65=1,W$9,IF(X65=1,X$9,IF(Y65=1,Y$9,IF(Z65=1,Z$9,IF(AA65=1,AA$9,IF(AB65=1,AB$9,\"\")))))))))))","v":""},"Après-midi",null,"AP",{"$f":"IF($S$65=$T$32,1,\"\")","v":""},{"$f":"IF(AND($S$65=$U$32,T65=\"\"),1,\"\")","v":""},{"$f":"IF(AND($S$65=$V$32,U65=\"\",T65=\"\"),1,\"\")","v":""},{"$f":"IF(AND($S$65=W32,T65=\"\",U65=\"\",V65=\"\"),1,\"\")","v":""},{"$f":"IF(AND($S$65=$X$32,U65=\"\",V65=\"\",W65=\"\",T65=\"\"),1,\"\")","v":""},{"$f":"IF(AND($S$65=$Y$32,V65=\"\",W65=\"\",X65=\"\",U65=\"\",T65=\"\"),1,\"\")","v":""},{"$f":"IF(AND($S$65=Z32,W65=\"\",X65=\"\",Y65=\"\",V65=\"\",U65=\"\",T65=\"\"),1,\"\")","v":""},{"$f":"IF(AND($S$65=AA32,X65=\"\",Y65=\"\",Z65=\"\",W65=\"\",V65=\"\",U65=\"\",T65=\"\"),1,\"\")","v":""},{"$f":"IF(AND($S$65=$AB$32,Y65=\"\",Z65=\"\",AA65=\"\",X65=\"\",W65=\"\",V65=\"\",U65=\"\",T65=\"\"),1,\"\")","v":""},{"$f":"IF(AND($S$65=$AC$32,Z65=\"\",AA65=\"\",AB65=\"\",Y65=\"\",X65=\"\",W65=\"\",V65=\"\",U65=\"\",T65=\"\"),1,\"\")","v":""},{"$f":"IF(AND($S$65=$AD$32,AA65=\"\",AB65=\"\",AC65=\"\",Z65=\"\",Y65=\"\",X65=\"\",W65=\"\",V65=\"\",U65=\"\",T65=\"\"),1,\"\")","v":""},{"$f":"IF(AND($S$65=$AE$32,AB65=\"\",AC65=\"\",AD65=\"\",AA65=\"\",Z65=\"\",Y65=\"\",X65=\"\",W65=\"\",V65=\"\",U65=\"\",T65=\"\"),1,\"\")","v":""},{"$f":"IF(AND($S$65=$AF$32,AC65=\"\",AD65=\"\",AE65=\"\",AB65=\"\",AA65=\"\",Z65=\"\",Y65=\"\",X65=\"\",W65=\"\",V65=\"\",U65=\"\",T65=\"\"),1,\"\")","v":""},{"$f":"IF(AND($S$65=$AG$32,AD65=\"\",AE65=\"\",AF65=\"\",AC65=\"\",AB65=\"\",AA65=\"\",Z65=\"\",Y65=\"\",X65=\"\",W65=\"\",V65=\"\",U65=\"\",T65=\"\"),1,\"\")","v":""},{"$f":"IF(AND($S$65=$AH$32,AE65=\"\",AF65=\"\",AG65=\"\",AD65=\"\",AC65=\"\",AB65=\"\",AA65=\"\",Z65=\"\",Y65=\"\",X65=\"\",W65=\"\",V65=\"\",U65=\"\",T65=\"\"),1,\"\")","v":""},null,null,null,null,null,null,null,null,null,null,null,null,null,null,null,null,null,null,51]
[null,null,null,null,null,null,null,null,null,null,null,null,null,null,{"$f":"IF(T66=1,$T$3,IF(U66=1,$U$3,IF(V66=1,$V$3,IF(W66=1,$W$3,IF(X66=1,$X$3,IF(Y66=1,$Y$3,IF(Z66=1,$Z$3,IF(AA66=1,$AA$3,IF(AB66=1,$AB$3,IF(AC66=1,$AC$3,IF(AD66=1,$AD$3,IF(AE66=1,$AE$3,IF(AF66=1,$AF$3,IF(AG66=1,$AG$3,IF(AH66=1,$AH$3,\"\")))))))))))))))","v":""},{"$f":"IF(R66=1,R$9,IF(S66=1,S$9,IF(T66=1,T$9,IF(U66=1,U$9,IF(V66=1,V$9,IF(W66=1,W$9,IF(X66=1,X$9,IF(Y66=1,Y$9,IF(Z66=1,Z$9,IF(AA66=1,AA$9,IF(AB66=1,AB$9,\"\")))))))))))","v":""},null,null,"AP",null,{"$f":"IF(AND(U$32=$S$66,T66=\"\",U65=\"\"),1,\"\")","v":""},{"$f":"IF(AND(V$32=$S$66,U66=\"\",V65=\"\"),1,\"\")","v":""},{"$f":"IF(AND(W$32=$S$66,V66=\"\",W65=\"\"),1,\"\")","v":""},{"$f":"IF(AND(X$32=$S$66,X65=\"\",SUM($U$66:W66)=0),1,\"\")","v":""},{"$f":"IF(AND(Y$32=$S$66,Y65=\"\",SUM($U$66:X66)=0),1,\"\")","v":""},{"$f":"IF(AND(Z$32=$S$66,Z65=\"\",SUM($U$66:Y66)=0),1,\"\")","v":""},{"$f":"IF(AND(AA$32=$S$66,AA65=\"\",SUM($U$66:Z66)=0),1,\"\")","v":""},{"$f":"IF(AND(AB$32=$S$66,AB65=\"\",SUM($U$66:AA66)=0),1,\"\")","v":""},{"$f":"IF(AND(AC$32=$S$66,AC65=\"\",SUM($U$66:AB66)=0),1,\"\")","v":""},{"$f":"IF(AND(AD$32=$S$66,AD65=\"\",SUM($U$66:AC66)=0),1,\"\")","v":""},{"$f":"IF(AND(AE$32=$S$66,AE65=\"\",SUM($U$66:AD66)=0),1,\"\")","v":""},{"$f":"IF(AND(AF$32=$S$66,AF65=\"\",SUM($U$66:AE66)=0),1,\"\")","v":""},{"$f":"IF(AND(AG$32=$S$66,AG65=\"\",SUM($U$66:AF66)=0),1,\"\")","v":""},{"$f":"IF(AND(AH$32=$S$66,AH65=\"\",SUM($U$66:AG66)=0),1,\"\")","v":""},null,null,null,null,null,null,null,null,null,null,null,null,null,null,null,null,null,null,52]
[null,null,null,null,null,null,null,null,null,null,null,null,null,null,{"$f":"IF(T67=1,$T$3,IF(U67=1,$U$3,IF(V67=1,$V$3,IF(W67=1,$W$3,IF(X67=1,$X$3,IF(Y67=1,$Y$3,IF(Z67=1,$Z$3,IF(AA67=1,$AA$3,IF(AB67=1,$AB$3,IF(AC67=1,$AC$3,IF(AD67=1,$AD$3,IF(AE67=1,$AE$3,IF(AF67=1,$AF$3,IF(AG67=1,$AG$3,IF(AH67=1,$AH$3,\"\")))))))))))))))","v":""},"",null,null,"AP",null,null,{"$f":"IF(AND(V$32=S67,U67=\"\",V66=\"\",V65=\"\"),1,\"\")","v":""},{"$f":"IF(AND(W$32=S67,V67=\"\",W66=\"\",W65=\"\"),1,\"\")","v":""},{"$f":"IF(AND(X$32=$S$67,X65=\"\",X66=\"\",SUM($V$62:W67)=0),1,\"\")","v":""},{"$f":"IF(AND(Y$32=$S$67,Y65=\"\",Y66=\"\",SUM($V$67:X67)=0),1,\"\")","v":""},{"$f":"IF(AND(Z$32=$S$67,Z65=\"\",Z66=\"\",SUM($V$67:Y67)=0),1,\"\")","v":""},{"$f":"IF(AND(AA$32=$S$67,AA65=\"\",AA66=\"\",SUM($V$67:Z67)=0),1,\"\")","v":""},{"$f":"IF(AND(AB$32=$S$67,AB65=\"\",AB66=\"\",SUM($V$67:AA67)=0),1,\"\")","v":""},{"$f":"IF(AND(AC$32=$S$67,AC65=\"\",AC66=\"\",SUM($V$67:AB67)=0),1,\"\")","v":""},{"$f":"IF(AND(AD$32=$S$67,AD65=\"\",AD66=\"\",SUM($V$67:AC67)=0),1,\"\")","v":""},{"$f":"IF(AND(AE$32=$S$67,AE65=\"\",AE66=\"\",SUM($V$67:AD67)=0),1,\"\")","v":""},{"$f":"IF(AND(AF$32=$S$67,AF65=\"\",AF66=\"\",SUM($V$67:AE67)=0),1,\"\")","v":""},{"$f":"IF(AND(AG$32=$S$67,AG65=\"\",AG66=\"\",SUM($V$67:AF67)=0),1,\"\")","v":""},{"$f":"IF(AND(AH$32=$S$67,AH65=\"\",AH66=\"\",SUM($V$67:AG67)=0),1,\"\")","v":""},null,null,null,null,null,null,null,null,null,null,null,null,null,null,null,null,null,null,53]
[]
[]
[null,null,null,null,null,null,null,null,null,null,null,null,null,null,{"$f":"IF(T70=1,$T$3,IF(U70=1,$U$3,IF(V70=1,$V$3,IF(W70=1,$W$3,IF(X70=1,$X$3,IF(Y70=1,$Y$3,IF(Z70=1,$Z$3,IF(AA70=1,$AA$3,IF(AB70=1,$AB$3,IF(AC70=1,$AC$3,IF(AD70=1,$AD$3,IF(AE70=1,$AE$3,IF(AF70=1,$AF$3,IF(AG70=1,$AG$3,IF(AH70=1,$AH$3,\"\")))))))))))))))","v":""},{"$f":"IF(R70=1,R$9,IF(S70=1,S$9,IF(T70=1,T$9,IF(U70=1,U$9,IF(V70=1,V$9,IF(W70=1,W$9,IF(X70=1,X$9,IF(Y70=1,Y$9,IF(Z70=1,Z$9,IF(AA70=1,AA$9,IF(AB70=1,AB$9,\"\")))))))))))","v":""},"Soir",null,"S",{"$f":"IF($S$70=$T$32,1,\"\")","v":""},{"$f":"IF(AND($S$70=$U$32,T70=\"\"),1,\"\")","v":""},{"$f":"IF(AND($S$70=$V$32,U70=\"\",T70=\"\"),1,\"\")","v":""},{"$f":"IF(AND($S$70=$W$32,T70=\"\",U70=\"\",V70=\"\"),1,\"\")","v":""},{"$f":"IF(AND($S$70=$X$32,U70=\"\",V70=\"\",W70=\"\",T70=\"\"),1,\"\")","v":""},{"$f":"IF(AND($S$70=$Y$32,V70=\"\",W70=\"\",X70=\"\",U70=\"\",T70=\"\"),1,\"\")","v":""},{"$f":"IF(AND($S$70=Z60,W70=\"\",X70=\"\",Y70=\"\",V70=\"\",U70=\"\",T70=\"\"),1,\"\")","v":""},{"$f":"IF(AND($S$70=AA60,X70=\"\",Y70=\"\",Z70=\"\",W70=\"\",V70=\"\",U70=\"\",T70=\"\"),1,\"\")","v":""},{"$f":"IF(AND($S$70=$AB$32,Y70=\"\",Z70=\"\",AA70=\"\",X70=\"\",W70=\"\",V70=\"\",U70=\"\",T70=\"\"),1,\"\")","v":""},{"$f":"IF(AND($S$70=$AC$32,Z70=\"\",AA70=\"\",AB70=\"\",Y70=\"\",X70=\"\",W70=\"\",V70=\"\",U70=\"\",T70=\"\"),1,\"\")","v":""},{"$f":"IF(AND($S$70=$AD$32,AA70=\"\",AB70=\"\",AC70=\"\",Z70=\"\",Y70=\"\",X70=\"\",W70=\"\",V70=\"\",U70=\"\",T70=\"\"),1,\"\")","v":""},{"$f":"IF(AND($S$70=$AE$32,AB70=\"\",AC70=\"\",AD70=\"\",AA70=\"\",Z70=\"\",Y70=\"\",X70=\"\",W70=\"\",V70=\"\",U70=\"\",T70=\"\"),1,\"\")","v":""},{"$f":"IF(AND($S$70=$AF$32,AC70=\"\",AD70=\"\",AE70=\"\",AB70=\"\",AA70=\"\",Z70=\"\",Y70=\"\",X70=\"\",W70=\"\",V70=\"\",U70=\"\",T70=\"\"),1,\"\")","v":""},{"$f":"IF(AND($S$70=$AG$32,AD70=\"\",AE70=\"\",AF70=\"\",AC70=\"\",AB70=\"\",AA70=\"\",Z70=\"\",Y70=\"\",X70=\"\",W70=\"\",V70=\"\",U70=\"\",T70=\"\"),1,\"\")","v":""},{"$f":"IF(AND($S$70=$AH$32,AE70=\"\",AF70=\"\",AG70=\"\",AD70=\"\",AC70=\"\",AB70=\"\",AA70=\"\",Z70=\"\",Y70=\"\",X70=\"\",W70=\"\",V70=\"\",U70=\"\",T70=\"\"),1,\"\")","v":""}]
[null,null,null,null,null,null,null,null,null,null,null,null,null,null,{"$f":"IF(T71=1,$T$3,IF(U71=1,$U$3,IF(V71=1,$V$3,IF(W71=1,$W$3,IF(X71=1,$X$3,IF(Y71=1,$Y$3,IF(Z71=1,$Z$3,IF(AA71=1,$AA$3,IF(AB71=1,$AB$3,IF(AC71=1,$AC$3,IF(AD71=1,$AD$3,IF(AE71=1,$AE$3,IF(AF71=1,$AF$3,IF(AG71=1,$AG$3,IF(AH71=1,$AH$3,\"\")))))))))))))))","v":""},{"$f":"IF(R71=1,R$9,IF(S71=1,S$9,IF(T71=1,T$9,IF(U71=1,U$9,IF(V71=1,V$9,IF(W71=1,W$9,IF(X71=1,X$9,IF(Y71=1,Y$9,IF(Z71=1,Z$9,IF(AA71=1,AA$9,IF(AB71=1,AB$9,\"\")))))))))))","v":""},null,null,"S",null,{"$f":"IF(AND(U$32=$S$71,T71=\"\",U70=\"\"),1,\"\")","v":""},{"$f":"IF(AND(V$32=$S$71,U71=\"\",V70=\"\"),1,\"\")","v":""},{"$f":"IF(AND(W$32=$S$71,V71=\"\",W70=\"\"),1,\"\")","v":""},{"$f":"IF(AND(X$32=$S$71,X70=\"\",SUM($U$71:W71)=0),1,\"\")","v":""},{"$f":"IF(AND(Y$32=$S$71,Y70=\"\",SUM($U$71:X71)=0),1,\"\")","v":""},{"$f":"IF(AND(Z$32=$S$71,Z70=\"\",SUM($U$71:Y71)=0),1,\"\")","v":""},{"$f":"IF(AND(AA$32=$S$71,AA70=\"\",SUM($U$71:Z71)=0),1,\"\")","v":""},{"$f":"IF(AND(AB$32=$S$71,AB70=\"\",SUM($U$71:AA71)=0),1,\"\")","v":""},{"$f":"IF(AND(AC$32=$S$71,AC70=\"\",SUM($U$71:AB71)=0),1,\"\")","v":""},{"$f":"IF(AND(AD$32=$S$71,AD70=\"\",SUM($U$71:AC71)=0),1,\"\")","v":""},{"$f":"IF(AND(AE$32=$S$71,AE70=\"\",SUM($U$71:AD71)=0),1,\"\")","v":""},{"$f":"IF(AND(AF$32=$S$71,AF70=\"\",SUM($U$71:AE71)=0),1,\"\")","v":""},{"$f":"IF(AND(AG$32=$S$71,AG70=\"\",SUM($U$71:AF71)=0),1,\"\")","v":""},{"$f":"IF(AND(AH$32=$S$71,AH70=\"\",SUM($U$71:AG71)=0),1,\"\")","v":""}]
[null,null,null,null,null,null,null,null,null,null,null,null,null,null,{"$f":"IF(T72=1,$T$3,IF(U72=1,$U$3,IF(V72=1,$V$3,IF(W72=1,$W$3,IF(X72=1,$X$3,IF(Y72=1,$Y$3,IF(Z72=1,$Z$3,IF(AA72=1,$AA$3,IF(AB72=1,$AB$3,IF(AC72=1,$AC$3,IF(AD72=1,$AD$3,IF(AE72=1,$AE$3,IF(AF72=1,$AF$3,IF(AG72=1,$AG$3,IF(AH72=1,$AH$3,\"\")))))))))))))))","v":""},"",null,null,"S",null,null,{"$f":"IF(AND(V$32=S72,U72=\"\",V71=\"\",V70=\"\"),1,\"\")","v":""},{"$f":"IF(AND(W$32=S72,V72=\"\",W71=\"\",W70=\"\"),1,\"\")","v":""},{"$f":"IF(AND(X$32=$S$72,X70=\"\",X71=\"\",SUM($V$72:W72)=0),1,\"\")","v":""},{"$f":"IF(AND(Y$32=$S$72,Y70=\"\",Y71=\"\",SUM($V$72:X72)=0),1,\"\")","v":""},{"$f":"IF(AND(Z$32=$S$72,Z70=\"\",Z71=\"\",SUM($V$72:Y72)=0),1,\"\")","v":""},{"$f":"IF(AND(AA$32=$S$72,AA70=\"\",AA71=\"\",SUM($V$72:Z72)=0),1,\"\")","v":""},{"$f":"IF(AND(AB$32=$S$72,AB70=\"\",AB71=\"\",SUM($V$72:AA72)=0),1,\"\")","v":""},{"$f":"IF(AND(AC$32=$S$72,AC70=\"\",AC71=\"\",SUM($V$72:AB72)=0),1,\"\")","v":""},{"$f":"IF(AND(AD$32=$S$72,AD70=\"\",AD71=\"\",SUM($V$72:AC72)=0),1,\"\")","v":""},{"$f":"IF(AND(AE$32=$S$72,AE70=\"\",AE71=\"\",SUM($V$72:AD72)=0),1,\"\")","v":""},{"$f":"IF(AND(AF$32=$S$72,AF70=\"\",AF71=\"\",SUM($V$72:AE72)=0),1,\"\")","v":""},{"$f":"IF(AND(AG$32=$S$72,AG70=\"\",AG71=\"\",SUM($V$72:AF72)=0),1,\"\")","v":""},{"$f":"IF(AND(AH$32=$S$72,AH70=\"\",AH71=\"\",SUM($V$72:AG72)=0),1,\"\")","v":""}]
[]
[]
[null,null,null,null,null,null,null,null,null,null,null,null,null,null,{"$f":"IF(T75=1,$T$3,IF(U75=1,$U$3,IF(V75=1,$V$3,IF(W75=1,$W$3,IF(X75=1,$X$3,IF(Y75=1,$Y$3,IF(Z75=1,$Z$3,IF(AA75=1,$AA$3,IF(AB75=1,$AB$3,IF(AC75=1,$AC$3,IF(AD75=1,$AD$3,IF(AE75=1,$AE$3,IF(AF75=1,$AF$3,IF(AG75=1,$AG$3,IF(AH75=1,$AH$3,\"\")))))))))))))))","v":""},{"$f":"IF(R75=1,R$9,IF(S75=1,S$9,IF(T75=1,T$9,IF(U75=1,U$9,IF(V75=1,V$9,IF(W75=1,W$9,IF(X75=1,X$9,IF(Y75=1,Y$9,IF(Z75=1,Z$9,IF(AA75=1,AA$9,IF(AB75=1,AB$9,\"\")))))))))))","v":""},"Nuit",null,"N",{"$f":"IF($S$75=$T$32,1,\"\")","v":""},{"$f":"IF(AND($S$75=$U$32,T75=\"\"),1,\"\")","v":""},{"$f":"IF(AND($S$75=$V$32,U75=\"\",T75=\"\"),1,\"\")","v":""},{"$f":"IF(AND($S$75=$W$32,T75=\"\",U75=\"\",V75=\"\"),1,\"\")","v":""},{"$f":"IF(AND($S$75=$X$32,U75=\"\",V75=\"\",W75=\"\",T75=\"\"),1,\"\")","v":""},{"$f":"IF(AND($S$75=$Y$32,V75=\"\",W75=\"\",X75=\"\",U75=\"\",T75=\"\"),1,\"\")","v":""},{"$f":"IF(AND($S$75=Z32,W75=\"\",X75=\"\",Y75=\"\",V75=\"\",U75=\"\",T75=\"\"),1,\"\")","v":""},{"$f":"IF(AND($S$75=AA32,X75=\"\",Y75=\"\",Z75=\"\",W75=\"\",V75=\"\",U75=\"\",T75=\"\"),1,\"\")","v":""},{"$f":"IF(AND($S$75=$AB$32,Y75=\"\",Z75=\"\",AA75=\"\",X75=\"\",W75=\"\",V75=\"\",U75=\"\",T75=\"\"),1,\"\")","v":""},{"$f":"IF(AND($S$75=$AC$32,Z75=\"\",AA75=\"\",AB75=\"\",Y75=\"\",X75=\"\",W75=\"\",V75=\"\",U75=\"\",T75=\"\"),1,\"\")","v":""},{"$f":"IF(AND($S$75=$AD$32,AA75=\"\",AB75=\"\",AC75=\"\",Z75=\"\",Y75=\"\",X75=\"\",W75=\"\",V75=\"\",U75=\"\",T75=\"\"),1,\"\")","v":""},{"$f":"IF(AND($S$75=$AE$32,AB75=\"\",AC75=\"\",AD75=\"\",AA75=\"\",Z75=\"\",Y75=\"\",X75=\"\",W75=\"\",V75=\"\",U75=\"\",T75=\"\"),1,\"\")","v":""},{"$f":"IF(AND($S$75=$AF$32,AC75=\"\",AD75=\"\",AE75=\"\",AB75=\"\",AA75=\"\",Z75=\"\",Y75=\"\",X75=\"\",W75=\"\",V75=\"\",U75=\"\",T75=\"\"),1,\"\")","v":""},{"$f":"IF(AND($S$75=$AG$32,AD75=\"\",AE75=\"\",AF75=\"\",AC75=\"\",AB75=\"\",AA75=\"\",Z75=\"\",Y75=\"\",X75=\"\",W75=\"\",V75=\"\",U75=\"\",T75=\"\"),1,\"\")","v":""},{"$f":"IF(AND($S$75=$AH$32,AE75=\"\",AF75=\"\",AG75=\"\",AD75=\"\",AC75=\"\",AB75=\"\",AA75=\"\",Z75=\"\",Y75=\"\",X75=\"\",W75=\"\",V75=\"\",U75=\"\",T75=\"\"),1,\"\")","v":""}]
[null,null,null,null,null,null,null,null,null,null,null,null,null,null,{"$f":"IF(T76=1,$T$3,IF(U76=1,$U$3,IF(V76=1,$V$3,IF(W76=1,$W$3,IF(X76=1,$X$3,IF(Y76=1,$Y$3,IF(Z76=1,$Z$3,IF(AA76=1,$AA$3,IF(AB76=1,$AB$3,IF(AC76=1,$AC$3,IF(AD76=1,$AD$3,IF(AE76=1,$AE$3,IF(AF76=1,$AF$3,IF(AG76=1,$AG$3,IF(AH76=1,$AH$3,\"\")))))))))))))))","v":""},{"$f":"IF(R76=1,R$9,IF(S76=1,S$9,IF(T76=1,T$9,IF(U76=1,U$9,IF(V76=1,V$9,IF(W76=1,W$9,IF(X76=1,X$9,IF(Y76=1,Y$9,IF(Z76=1,Z$9,IF(AA76=1,AA$9,IF(AB76=1,AB$9,\"\")))))))))))","v":""},null,null,"N",null,{"$f":"IF(AND(U$32=$S$76,T76=\"\",U75=\"\"),1,\"\")","v":""},{"$f":"IF(AND(V$32=$S$76,U76=\"\",V75=\"\"),1,\"\")","v":""},{"$f":"IF(AND(W$32=$S$76,V76=\"\",W75=\"\"),1,\"\")","v":""},{"$f":"IF(AND(X$32=$S$76,X75=\"\",SUM($U$76:W76)=0),1,\"\")","v":""},{"$f":"IF(AND(Y$32=$S$76,Y75=\"\",SUM($U$76:X76)=0),1,\"\")","v":""},{"$f":"IF(AND(Z$32=$S$76,Z75=\"\",SUM($U$76:Y76)=0),1,\"\")","v":""},{"$f":"IF(AND(AA$32=$S$76,AA75=\"\",SUM($U$76:Z76)=0),1,\"\")","v":""},{"$f":"IF(AND(AB$32=$S$76,AB75=\"\",SUM($U$76:AA76)=0),1,\"\")","v":""},{"$f":"IF(AND(AC$32=$S$76,AC75=\"\",SUM($U$76:AB76)=0),1,\"\")","v":""},{"$f":"IF(AND(AD$32=$S$76,AD75=\"\",SUM($U$76:AC76)=0),1,\"\")","v":""},{"$f":"IF(AND(AE$32=$S$76,AE75=\"\",SUM($U$76:AD76)=0),1,\"\")","v":""},{"$f":"IF(AND(AF$32=$S$76,AF75=\"\",SUM($U$76:AE76)=0),1,\"\")","v":""},{"$f":"IF(AND(AG$32=$S$76,AG75=\"\",SUM($U$76:AF76)=0),1,\"\")","v":""},{"$f":"IF(AND(AH$32=$S$76,AH75=\"\",SUM($U$76:AG76)=0),1,\"\")","v":""}]
[null,null,null,null,null,null,null,null,null,null,null,null,null,null,{"$f":"IF(T77=1,$T$3,IF(U77=1,$U$3,IF(V77=1,$V$3,IF(W77=1,$W$3,IF(X77=1,$X$3,IF(Y77=1,$Y$3,IF(Z77=1,$Z$3,IF(AA77=1,$AA$3,IF(AB77=1,$AB$3,IF(AC77=1,$AC$3,IF(AD77=1,$AD$3,IF(AE77=1,$AE$3,IF(AF77=1,$AF$3,IF(AG77=1,$AG$3,IF(AH77=1,$AH$3,\"\")))))))))))))))","v":""},"",null,null,"N",null,null,{"$f":"IF(AND(V$32=S77,U77=\"\",V76=\"\",V75=\"\"),1,\"\")","v":""},{"$f":"IF(AND(W$32=S77,V77=\"\",W76=\"\",W75=\"\"),1,\"\")","v":""},{"$f":"IF(AND(X$32=$S$77,X75=\"\",X76=\"\",SUM($V$77:W77)=0),1,\"\")","v":""},{"$f":"IF(AND(Y$32=$S$77,Y75=\"\",Y76=\"\",SUM($V$77:X77)=0),1,\"\")","v":""},{"$f":"IF(AND(Z$32=$S$77,Z75=\"\",Z76=\"\",SUM($V$77:Y77)=0),1,\"\")","v":""},{"$f":"IF(AND(AA$32=$S$77,AA75=\"\",AA76=\"\",SUM($V$77:Z77)=0),1,\"\")","v":""},{"$f":"IF(AND(AB$32=$S$77,AB75=\"\",AB76=\"\",SUM($V$77:AA77)=0),1,\"\")","v":""},{"$f":"IF(AND(AC$32=$S$77,AC75=\"\",AC76=\"\",SUM($V$77:AB77)=0),1,\"\")","v":""},{"$f":"IF(AND(AD$32=$S$77,AD75=\"\",AD76=\"\",SUM($V$77:AC77)=0),1,\"\")","v":""},{"$f":"IF(AND(AE$32=$S$77,AE75=\"\",AE76=\"\",SUM($V$77:AD77)=0),1,\"\")","v":""},{"$f":"IF(AND(AF$32=$S$77,AF75=\"\",AF76=\"\",SUM($V$77:AE77)=0),1,\"\")","v":""},{"$f":"IF(AND(AG$32=$S$77,AG75=\"\",AG76=\"\",SUM($V$77:AF77)=0),1,\"\")","v":""},{"$f":"IF(AND(AH$32=$S$77,AH75=\"\",AH76=\"\",SUM($V$77:AG77)=0),1,\"\")","v":""}]
[]
[null,null,null,null,null,null,null,null,null,null,null,null,null,null,{"$f":"IF(T79=1,$T$3,IF(U79=1,$U$3,IF(V79=1,$V$3,IF(W79=1,$W$3,IF(X79=1,$X$3,IF(Y79=1,$Y$3,IF(Z79=1,$Z$3,IF(AA79=1,$AA$3,IF(AB79=1,$AB$3,IF(AC79=1,$AC$3,IF(AD79=1,$AD$3,IF(AE79=1,$AE$3,IF(AF79=1,$AF$3,IF(AG79=1,$AG$3,IF(AH79=1,$AH$3,\"\")))))))))))))))","v":""},null,"Nuit",null,"D",{"$f":"IF($S$79=$T$32,1,\"\")","v":""},{"$f":"IF(AND($S$79=$U$32,T79=\"\"),1,\"\")","v":""},{"$f":"IF(AND($S$79=$V$32,U79=\"\",T79=\"\"),1,\"\")","v":""},{"$f":"IF(AND($S$79=$W$32,T79=\"\",U79=\"\",V79=\"\"),1,\"\")","v":""},{"$f":"IF(AND($S$79=$X$32,U79=\"\",V79=\"\",W79=\"\",T79=\"\"),1,\"\")","v":""},{"$f":"IF(AND($S$79=$Y$32,V79=\"\",W79=\"\",X79=\"\",U79=\"\",T79=\"\"),1,\"\")","v":""},{"$f":"IF(AND($S$79=Z32,W79=\"\",X79=\"\",Y79=\"\",V79=\"\",U79=\"\",T79=\"\"),1,\"\")","v":""},{"$f":"IF(AND($S$79=AA32,X79=\"\",Y79=\"\",Z79=\"\",W79=\"\",V79=\"\",U79=\"\",T79=\"\"),1,\"\")","v":""},{"$f":"IF(AND($S$79=$AB$32,Y79=\"\",Z79=\"\",AA79=\"\",X79=\"\",W79=\"\",V79=\"\",U79=\"\",T79=\"\"),1,\"\")","v":""},{"$f":"IF(AND($S$79=$AC$32,Z79=\"\",AA79=\"\",AB79=\"\",Y79=\"\",X79=\"\",W79=\"\",V79=\"\",U79=\"\",T79=\"\"),1,\"\")","v":""},{"$f":"IF(AND($S$79=$AD$32,AA79=\"\",AB79=\"\",AC79=\"\",Z79=\"\",Y79=\"\",X79=\"\",W79=\"\",V79=\"\",U79=\"\",T79=\"\"),1,\"\")","v":""},{"$f":"IF(AND($S$79=$AE$32,AB79=\"\",AC79=\"\",AD79=\"\",AA79=\"\",Z79=\"\",Y79=\"\",X79=\"\",W79=\"\",V79=\"\",U79=\"\",T79=\"\"),1,\"\")","v":""},{"$f":"IF(AND($S$79=$AF$32,AC79=\"\",AD79=\"\",AE79=\"\",AB79=\"\",AA79=\"\",Z79=\"\",Y79=\"\",X79=\"\",W79=\"\",V79=\"\",U79=\"\",T79=\"\"),1,\"\")","v":""},{"$f":"IF(AND($S$79=$AG$32,AD79=\"\",AE79=\"\",AF79=\"\",AC79=\"\",AB79=\"\",AA79=\"\",Z79=\"\",Y79=\"\",X79=\"\",W79=\"\",V79=\"\",U79=\"\",T79=\"\"),1,\"\")","v":""},{"$f":"IF(AND($S$79=$AH$32,AE79=\"\",AF79=\"\",AG79=\"\",AD79=\"\",AC79=\"\",AB79=\"\",AA79=\"\",Z79=\"\",Y79=\"\",X79=\"\",W79=\"\",V79=\"\",U79=\"\",T79=\"\"),1,\"\")","v":""}]
[null,null,null,null,null,null,null,null,null,null,null,null,null,null,{"$f":"IF(T80=1,$T$3,IF(U80=1,$U$3,IF(V80=1,$V$3,IF(W80=1,$W$3,IF(X80=1,$X$3,IF(Y80=1,$Y$3,IF(Z80=1,$Z$3,IF(AA80=1,$AA$3,IF(AB80=1,$AB$3,IF(AC80=1,$AC$3,IF(AD80=1,$AD$3,IF(AE80=1,$AE$3,IF(AF80=1,$AF$3,IF(AG80=1,$AG$3,IF(AH80=1,$AH$3,\"\")))))))))))))))","v":""},null,null,null,"D",null,{"$f":"IF(AND(U$32=$S$80,T80=\"\",U79=\"\"),1,\"\")","v":""},{"$f":"IF(AND(V$32=$S$80,U80=\"\",V79=\"\"),1,\"\")","v":""},{"$f":"IF(AND(W$32=$S$80,V80=\"\",W79=\"\"),1,\"\")","v":""},{"$f":"IF(AND(X$32=$S$80,X79=\"\",SUM($U$80:W80)=0),1,\"\")","v":""},{"$f":"IF(AND(Y$32=$S$80,Y79=\"\",SUM($U$80:X80)=0),1,\"\")","v":""},{"$f":"IF(AND(Z$32=$S$80,Z79=\"\",SUM($U$80:Y80)=0),1,\"\")","v":""},{"$f":"IF(AND(AA$32=$S$80,AA79=\"\",SUM($U$80:Z80)=0),1,\"\")","v":""},{"$f":"IF(AND(AB$32=$S$80,AB79=\"\",SUM($U$80:AA80)=0),1,\"\")","v":""},{"$f":"IF(AND(AC$32=$S$80,AC79=\"\",SUM($U$80:AB80)=0),1,\"\")","v":""},{"$f":"IF(AND(AD$32=$S$80,AD79=\"\",SUM($U$80:AC80)=0),1,\"\")","v":""},{"$f":"IF(AND(AE$32=$S$80,AE79=\"\",SUM($U$80:AD80)=0),1,\"\")","v":""},{"$f":"IF(AND(AF$32=$S$80,AF79=\"\",SUM($U$80:AE80)=0),1,\"\")","v":""},{"$f":"IF(AND(AG$32=$S$80,AG79=\"\",SUM($U$80:AF80)=0),1,\"\")","v":""},{"$f":"IF(AND(AH$32=$S$80,AH79=\"\",SUM($U$80:AG80)=0),1,\"\")","v":""}]
[null,null,null,null,null,null,null,null,null,null,null,null,null,null,{"$f":"IF(T81=1,$T$3,IF(U81=1,$U$3,IF(V81=1,$V$3,IF(W81=1,$W$3,IF(X81=1,$X$3,IF(Y81=1,$Y$3,IF(Z81=1,$Z$3,IF(AA81=1,$AA$3,IF(AB81=1,$AB$3,IF(AC81=1,$AC$3,IF(AD81=1,$AD$3,IF(AE81=1,$AE$3,IF(AF81=1,$AF$3,IF(AG81=1,$AG$3,IF(AH81=1,$AH$3,\"\")))))))))))))))","v":""},null,null,null,"D",null,null,{"$f":"IF(AND(V$32=S81,U81=\"\",V80=\"\",V79=\"\"),1,\"\")","v":""},{"$f":"IF(AND(W$32=S81,V81=\"\",W80=\"\",W79=\"\"),1,\"\")","v":""},{"$f":"IF(AND(X$32=$S$81,X79=\"\",X80=\"\",SUM($V$81:W81)=0),1,\"\")","v":""},{"$f":"IF(AND(Y$32=$S$81,Y79=\"\",Y80=\"\",SUM($V$81:X81)=0),1,\"\")","v":""},{"$f":"IF(AND(Z$32=$S$81,Z79=\"\",Z80=\"\",SUM($V$81:Y81)=0),1,\"\")","v":""},{"$f":"IF(AND(AA$32=$S$81,AA79=\"\",AA80=\"\",SUM($V$81:Z81)=0),1,\"\")","v":""},{"$f":"IF(AND(AB$32=$S$81,AB79=\"\",AB80=\"\",SUM($V$81:AA81)=0),1,\"\")","v":""},{"$f":"IF(AND(AC$32=$S$81,AC79=\"\",AC80=\"\",SUM($V$81:AB81)=0),1,\"\")","v":""},{"$f":"IF(AND(AD$32=$S$81,AD79=\"\",AD80=\"\",SUM($V$81:AC81)=0),1,\"\")","v":""},{"$f":"IF(AND(AE$32=$S$81,AE79=\"\",AE80=\"\",SUM($V$81:AD81)=0),1,\"\")","v":""},{"$f":"IF(AND(AF$32=$S$81,AF79=\"\",AF80=\"\",SUM($V$81:AE81)=0),1,\"\")","v":""},{"$f":"IF(AND(AG$32=$S$81,AG79=\"\",AG80=\"\",SUM($V$81:AF81)=0),1,\"\")","v":""},{"$f":"IF(AND(AH$32=$S$81,AH79=\"\",AH80=\"\",SUM($V$81:AG81)=0),1,\"\")","v":""}]
[]
[]
[null,null,null,null,null,null,null,null,null,null,null,{"$f":"S84","v":"Mardi"},{"$f":"LEN(N84)","v":0},{"$f":"(CONCATENATE(IF(T84=1,CONCATENATE(\"-\",T$3,\"(\",T10,\")\"),\"\"),IF(U84=1,CONCATENATE(\"-\",U$3,\"(\",U10,\")\"),\"\"),IF(V84=1,CONCATENATE(\"-\",V$3,\"(\",V10,\")\"),\"\"),IF(W84=1,CONCATENATE(\"-\",W$3,\"(\",W10,\")\"),\"\"),IF(X84=1,CONCATENATE(\"-\",X$3,\"(\",X10,\")\"),\"\"),IF(Y84=1,CONCATENATE(\"-\",Y$3,\"(\",Y10,\")\"),\"\"),IF(Z84=1,CONCATENATE(\"-\",Z$3,\"(\",Z10,\")\"),\"\"),IF(AA84=1,CONCATENATE(\"-\",AA$3,\"(\",AA10,\")\"),\"\"),IF(AB84=1,CONCATENATE(\"-\",AB$3,\"(\",AB10,\")\"),\"\"),IF(AC84=1,CONCATENATE(\"-\",AC$3,\"(\",AC10,\")\"),\"\"),IF(AD84=1,CONCATENATE(\"-\",AD$3,\"(\",AD10,\")\"),\"\"),IF(AE84=1,CONCATENATE(\"-\",AE$3,\"(\",AE10,\")\"),\"\"),IF(AF84=1,CONCATENATE(\"-\",AF$3,\"(\",AF10,\")\"),\"\"),IF(AG84=1,CONCATENATE(\"-\",AG$3,\"(\",AG10,\")\"),\"\"),IF(AH84=1,CONCATENATE(\"-\",AH$3,\"(\",AH10,\")\"),\"\")))","v":""},null,null,null,null,{"$f":"S10","v":"Mardi"},{"$f":"IF((COUNTIF(T10,$AJ$84)+COUNTIF(T10,$AJ$85)+COUNTIF(T10,$AJ$86)+COUNTIF(T10,$AJ$87)+COUNTIF(T10,$AJ$88)+COUNTIF(T10,$AJ$89)+COUNTIF(T10,$AJ$90)+COUNTIF(T10,$AJ$91)+COUNTIF(T10,$AJ$92)+COUNTIF(T10,$AJ$93))=0,\"\",COUNTIF(T10,$AJ$84)+COUNTIF(T10,$AJ$85)+COUNTIF(T10,$AJ$86)+COUNTIF(T10,$AJ$87)+COUNTIF(T10,$AJ$88)+COUNTIF(T10,$AJ$89)+COUNTIF(T10,$AJ$90)+COUNTIF(T10,$AJ$91)+COUNTIF(T10,$AJ$92)+COUNTIF(T10,$AJ$93))","v":""},{"$f":"IF((COUNTIF(U10,$AJ$84)+COUNTIF(U10,$AJ$85)+COUNTIF(U10,$AJ$86)+COUNTIF(U10,$AJ$87)+COUNTIF(U10,$AJ$88)+COUNTIF(U10,$AJ$89)+COUNTIF(U10,$AJ$90)+COUNTIF(U10,$AJ$91)+COUNTIF(U10,$AJ$92)+COUNTIF(U10,$AJ$93))=0,\"\",COUNTIF(U10,$AJ$84)+COUNTIF(U10,$AJ$85)+COUNTIF(U10,$AJ$86)+COUNTIF(U10,$AJ$87)+COUNTIF(U10,$AJ$88)+COUNTIF(U10,$AJ$89)+COUNTIF(U10,$AJ$90)+COUNTIF(U10,$AJ$91)+COUNTIF(U10,$AJ$92)+COUNTIF(U10,$AJ$93))","v":""},"","","","","","","","","","","","","",null,"CP"]
[null,null,null,null,null,null,null,null,null,null,null,{"$f":"S85","v":"Mercredi"},{"$f":"LEN(N85)","v":0},"",null,null,null,null,"Mercredi",{"$f":"IF((COUNTIF(T11,$AJ$84)+COUNTIF(T11,$AJ$85)+COUNTIF(T11,$AJ$86)+COUNTIF(T11,$AJ$87)+COUNTIF(T11,$AJ$88)+COUNTIF(T11,$AJ$89)+COUNTIF(T11,$AJ$90)+COUNTIF(T11,$AJ$91)+COUNTIF(T11,$AJ$92)+COUNTIF(T11,$AJ$93))=0,\"\",COUNTIF(T11,$AJ$84)+COUNTIF(T11,$AJ$85)+COUNTIF(T11,$AJ$86)+COUNTIF(T11,$AJ$87)+COUNTIF(T11,$AJ$88)+COUNTIF(T11,$AJ$89)+COUNTIF(T11,$AJ$90)+COUNTIF(T11,$AJ$91)+COUNTIF(T11,$AJ$92)+COUNTIF(T11,$AJ$93))","v":""},"","","","","","","","","","","","","","",null,"Recup"]
[null,null,null,null,null,null,null,null,null,null,null,"Jeudi",0,{"$f":"(CONCATENATE(IF(T86=1,CONCATENATE(\"-\",T$3,\"(\",T12,\")\"),\"\"),IF(U86=1,CONCATENATE(\"-\",U$3,\"(\",U12,\")\"),\"\"),IF(V86=1,CONCATENATE(\"-\",V$3,\"(\",V12,\")\"),\"\"),IF(W86=1,CONCATENATE(\"-\",W$3,\"(\",W12,\")\"),\"\"),IF(X86=1,CONCATENATE(\"-\",X$3,\"(\",X12,\")\"),\"\"),IF(Y86=1,CONCATENATE(\"-\",Y$3,\"(\",Y12,\")\"),\"\"),IF(Z86=1,CONCATENATE(\"-\",Z$3,\"(\",Z12,\")\"),\"\"),IF(AA86=1,CONCATENATE(\"-\",AA$3,\"(\",AA12,\")\"),\"\"),IF(AB86=1,CONCATENATE(\"-\",AB$3,\"(\",AB12,\")\"),\"\"),IF(AC86=1,CONCATENATE(\"-\",AC$3,\"(\",AC12,\")\"),\"\"),IF(AD86=1,CONCATENATE(\"-\",AD$3,\"(\",AD12,\")\"),\"\"),IF(AE86=1,CONCATENATE(\"-\",AE$3,\"(\",AE12,\")\"),\"\"),IF(AF86=1,CONCATENATE(\"-\",AF$3,\"(\",AF12,\")\"),\"\"),IF(AG86=1,CONCATENATE(\"-\",AG$3,\"(\",AG12,\")\"),\"\"),IF(AH86=1,CONCATENATE(\"-\",AH$3,\"(\",AH12,\")\"),\"\")))","v":""},null,null,null,null,"Jeudi",{"$f":"IF((COUNTIF(T12,$AJ$84)+COUNTIF(T12,$AJ$85)+COUNTIF(T12,$AJ$86)+COUNTIF(T12,$AJ$87)+COUNTIF(T12,$AJ$88)+COUNTIF(T12,$AJ$89)+COUNTIF(T12,$AJ$90)+COUNTIF(T12,$AJ$91)+COUNTIF(T12,$AJ$92)+COUNTIF(T12,$AJ$93))=0,\"\",COUNTIF(T12,$AJ$84)+COUNTIF(T12,$AJ$85)+COUNTIF(T12,$AJ$86)+COUNTIF(T12,$AJ$87)+COUNTIF(T12,$AJ$88)+COUNTIF(T12,$AJ$89)+COUNTIF(T12,$AJ$90)+COUNTIF(T12,$AJ$91)+COUNTIF(T12,$AJ$92)+COUNTIF(T12,$AJ$93))","v":""},"","","","","","","","","","","","","","",null,"Form"]
[null,null,null,null,null,null,null,null,null,null,null,"Vendredi",0,{"$f":"(CONCATENATE(IF(T87=1,CONCATENATE(\"-\",T$3,\"(\",T13,\")\"),\"\"),IF(U87=1,CONCATENATE(\"-\",U$3,\"(\",U13,\")\"),\"\"),IF(V87=1,CONCATENATE(\"-\",V$3,\"(\",V13,\")\"),\"\"),IF(W87=1,CONCATENATE(\"-\",W$3,\"(\",W13,\")\"),\"\"),IF(X87=1,CONCATENATE(\"-\",X$3,\"(\",X13,\")\"),\"\"),IF(Y87=1,CONCATENATE(\"-\",Y$3,\"(\",Y13,\")\"),\"\"),IF(Z87=1,CONCATENATE(\"-\",Z$3,\"(\",Z13,\")\"),\"\"),IF(AA87=1,CONCATENATE(\"-\",AA$3,\"(\",AA13,\")\"),\"\"),IF(AB87=1,CONCATENATE(\"-\",AB$3,\"(\",AB13,\")\"),\"\"),IF(AC87=1,CONCATENATE(\"-\",AC$3,\"(\",AC13,\")\"),\"\"),IF(AD87=1,CONCATENATE(\"-\",AD$3,\"(\",AD13,\")\"),\"\"),IF(AE87=1,CONCATENATE(\"-\",AE$3,\"(\",AE13,\")\"),\"\"),IF(AF87=1,CONCATENATE(\"-\",AF$3,\"(\",AF13,\")\"),\"\"),IF(AG87=1,CONCATENATE(\"-\",AG$3,\"(\",AG13,\")\"),\"\"),IF(AH87=1,CONCATENATE(\"-\",AH$3,\"(\",AH13,\")\"),\"\")))","v":""},null,null,null,null,"Vendredi",{"$f":"IF((COUNTIF(T13,$AJ$84)+COUNTIF(T13,$AJ$85)+COUNTIF(T13,$AJ$86)+COUNTIF(T13,$AJ$87)+COUNTIF(T13,$AJ$88)+COUNTIF(T13,$AJ$89)+COUNTIF(T13,$AJ$90)+COUNTIF(T13,$AJ$91)+COUNTIF(T13,$AJ$92)+COUNTIF(T13,$AJ$93))=0,\"\",COUNTIF(T13,$AJ$84)+COUNTIF(T13,$AJ$85)+COUNTIF(T13,$AJ$86)+COUNTIF(T13,$AJ$87)+COUNTIF(T13,$AJ$88)+COUNTIF(T13,$AJ$89)+COUNTIF(T13,$AJ$90)+COUNTIF(T13,$AJ$91)+COUNTIF(T13,$AJ$92)+COUNTIF(T13,$AJ$93))","v":""},"","","","","","","","","","","","","","",null,"Modul"]
[null,null,null,null,null,null,null,null,null,null,null,"Samedi",0,{"$f":"(CONCATENATE(IF(T88=1,CONCATENATE(\"-\",T$3,\"(\",T14,\")\"),\"\"),IF(U88=1,CONCATENATE(\"-\",U$3,\"(\",U14,\")\"),\"\"),IF(V88=1,CONCATENATE(\"-\",V$3,\"(\",V14,\")\"),\"\"),IF(W88=1,CONCATENATE(\"-\",W$3,\"(\",W14,\")\"),\"\"),IF(X88=1,CONCATENATE(\"-\",X$3,\"(\",X14,\")\"),\"\"),IF(Y88=1,CONCATENATE(\"-\",Y$3,\"(\",Y14,\")\"),\"\"),IF(Z88=1,CONCATENATE(\"-\",Z$3,\"(\",Z14,\")\"),\"\"),IF(AA88=1,CONCATENATE(\"-\",AA$3,\"(\",AA14,\")\"),\"\"),IF(AB88=1,CONCATENATE(\"-\",AB$3,\"(\",AB14,\")\"),\"\"),IF(AC88=1,CONCATENATE(\"-\",AC$3,\"(\",AC14,\")\"),\"\"),IF(AD88=1,CONCATENATE(\"-\",AD$3,\"(\",AD14,\")\"),\"\"),IF(AE88=1,CONCATENATE(\"-\",AE$3,\"(\",AE14,\")\"),\"\"),IF(AF88=1,CONCATENATE(\"-\",AF$3,\"(\",AF14,\")\"),\"\"),IF(AG88=1,CONCATENATE(\"-\",AG$3,\"(\",AG14,\")\"),\"\"),IF(AH88=1,CONCATENATE(\"-\",AH$3,\"(\",AH14,\")\"),\"\")))","v":""},null,null,null,null,"Samedi",{"$f":"IF((COUNTIF(T14,$AJ$84)+COUNTIF(T14,$AJ$85)+COUNTIF(T14,$AJ$86)+COUNTIF(T14,$AJ$87)+COUNTIF(T14,$AJ$88)+COUNTIF(T14,$AJ$89)+COUNTIF(T14,$AJ$90)+COUNTIF(T14,$AJ$91)+COUNTIF(T14,$AJ$92)+COUNTIF(T14,$AJ$93))=0,\"\",COUNTIF(T14,$AJ$84)+COUNTIF(T14,$AJ$85)+COUNTIF(T14,$AJ$86)+COUNTIF(T14,$AJ$87)+COUNTIF(T14,$AJ$88)+COUNTIF(T14,$AJ$89)+COUNTIF(T14,$AJ$90)+COUNTIF(T14,$AJ$91)+COUNTIF(T14,$AJ$92)+COUNTIF(T14,$AJ$93))","v":""},"","","","","","","","","","","","","","",null,"H.R"]
[null,null,null,null,null,null,null,null,null,null,null,"Dimanche",0,"",null,null,null,null,"Dimanche",{"$f":"IF((COUNTIF(T15,$AJ$84)+COUNTIF(T15,$AJ$85)+COUNTIF(T15,$AJ$86)+COUNTIF(T15,$AJ$87)+COUNTIF(T15,$AJ$88)+COUNTIF(T15,$AJ$89)+COUNTIF(T15,$AJ$90)+COUNTIF(T15,$AJ$91)+COUNTIF(T15,$AJ$92)+COUNTIF(T15,$AJ$93))=0,\"\",COUNTIF(T15,$AJ$84)+COUNTIF(T15,$AJ$85)+COUNTIF(T15,$AJ$86)+COUNTIF(T15,$AJ$87)+COUNTIF(T15,$AJ$88)+COUNTIF(T15,$AJ$89)+COUNTIF(T15,$AJ$90)+COUNTIF(T15,$AJ$91)+COUNTIF(T15,$AJ$92)+COUNTIF(T15,$AJ$93))","v":""},"","","","","","","","","","","","","","",null,"HR Nuit"]
[null,null,null,null,null,null,null,null,null,null,null,"Lundi",0,"",null,null,null,null,"Lundi",{"$f":"IF((COUNTIF(T16,$AJ$84)+COUNTIF(T16,$AJ$85)+COUNTIF(T16,$AJ$86)+COUNTIF(T16,$AJ$87)+COUNTIF(T16,$AJ$88)+COUNTIF(T16,$AJ$89)+COUNTIF(T16,$AJ$90)+COUNTIF(T16,$AJ$91)+COUNTIF(T16,$AJ$92)+COUNTIF(T16,$AJ$93))=0,\"\",COUNTIF(T16,$AJ$84)+COUNTIF(T16,$AJ$85)+COUNTIF(T16,$AJ$86)+COUNTIF(T16,$AJ$87)+COUNTIF(T16,$AJ$88)+COUNTIF(T16,$AJ$89)+COUNTIF(T16,$AJ$90)+COUNTIF(T16,$AJ$91)+COUNTIF(T16,$AJ$92)+COUNTIF(T16,$AJ$93))","v":""},"","","","","","","","","","","","","","",null,"RTT"]
[null,null,null,null,null,null,null,null,null,null,null,null,null,null,null,null,null,null,null,null,null,null,null,null,null,null,null,null,null,null,null,null,null,null,null,"Mal"]
[null,null,null,null,null,null,null,null,null,null,null,null,null,null,null,null,null,null,null,null,null,null,null,null,null,null,null,null,null,null,null,null,null,null,null,"J.A"]
[null,null,null,null,null,null,null,null,null,null,null,null,null,null,null,null,null,null,null,null,null,null,null,null,null,null,null,null,null,null,null,null,null,null,null,"Ecole"]

{"sheet":"Energie","index":3,"n_rows":81,"n_cols":56,"rows_kept":81,"cut":false,"hidden":false,"merged":[[8,8,8,10],[9,8,9,10],[2,1,2,3],[8,4,9,5],[6,3,7,3],[4,4,5,5],[6,4,7,5],[4,1,7,2],[4,3,5,3],[2,4,2,7],[2,8,2,10],[8,6,9,7],[12,3,13,3],[14,1,17,2],[14,3,15,3],[16,3,17,3],[19,1,24,3],[8,1,13,2],[8,3,9,3],[10,3,11,3],[17,8,17,10],[16,8,16,10],[15,8,15,10],[10,8,10,10],[11,8,11,10],[12,8,12,10],[13,8,13,10],[14,8,14,10],[16,4,17,5],[10,4,11,5],[12,4,13,5],[14,4,15,5],[10,6,11,7],[12,6,13,7],[14,6,15,7],[16,6,17,7],[77,16,77,18],[64,17,64,18],[64,19,66,19],[65,17,65,18],[66,17,66,18],[70,16,70,18],[71,16,71,18],[72,16,72,18],[73,16,73,18],[74,16,74,18],[75,16,75,18],[76,16,76,18],[54,17,54,18],[54,19,56,19],[55,17,55,18],[56,17,56,18],[59,17,59,18],[59,19,61,19],[60,17,60,18],[61,17,61,18],[44,17,44,18],[44,19,46,19],[45,17,45,18],[46,17,46,18],[49,17,49,18],[49,19,51,19],[50,17,50,18],[51,17,51,18],[34,17,34,18],[34,19,36,19],[35,17,35,18],[36,17,36,18],[39,17,39,18],[39,19,41,19],[40,17,40,18],[41,17,41,18],[30,19,32,19],[31,17,31,18],[32,17,32,18],[28,17,29,18],[30,17,30,18],[2,36,7,36],[2,25,7,25],[2,26,7,26],[2,27,7,27],[2,28,7,28],[2,29,7,29],[2,31,7,31],[2,32,7,32],[2,33,7,33],[2,34,7,34],[2,35,7,35],[2,30,7,30],[2,22,7,22],[2,23,7,23],[2,24,7,24],[3,1,3,11],[4,6,5,7],[6,6,7,7],[4,8,4,10],[5,8,5,10],[6,8,6,10],[7,8,7,10]]}
[]
[null,{"$f":"CONCATENATE(\"Du \",Q11,\"/\",R11,\"/\",S11,\" au \",Q12,\"/\",R12,\"/\",S12)","v":"Du 9/9/2019 au 15/9/2019"},null,null,null,null,null,null,null,null,"Semaine :",36,{"$f":"Planning_général!C2","v":2019},null,null,null,null,null,null,null,null,null,1,2,3,4,5,6,7,8,9]
[null,"Équipes",null,null,"Horaires",null,null,null,"NOM et Prénom",null,null,"Matricul","N°POSTE TEL ENTREE",null,null,null,null,null,null,null,null,null,{"$f":"Planning_général!$E47","v":"Resp Equipe 3"},{"$f":"Planning_général!$E48","v":"Equipe 3_Tech 1"},{"$f":"Planning_général!$E49","v":"Equipe 3_Tech 2"},{"$f":"Planning_général!$E50","v":"Equipe 3_Tech 3"},{"$f":"Planning_général!$E51","v":0},{"$f":"Planning_général!$E52","v":0},{"$f":"Planning_général!$E53","v":0},{"$f":"Planning_général!$E54","v":0}]
[]
[null,"JOURNEE",null,"J1","08 h 00 - 12 h 00 / 13 h00 - 16 h 00",null," Pause 10 h 00 -10 h 10 / 15 h 00 -15 h 10",null,{"$f":"IF(R31=\"\",\"\",R31)","v":""},null,null,{"$f":"IF(I5=\"\",\"\",VLOOKUP(I5,Planning_général!$E$47:$F$54,2,0))","v":""},null,null,null,"Initial",{"$f":"DATE(M2,1,1)","v":"2019-01-01"},{"$f":"Q5","v":43466}]
[null,null,null,null,null,null,null,null,{"$f":"IF(R32=\"\",\"\",R32)","v":""},null,null,{"$f":"IF(I6=\"\",\"\",VLOOKUP(I6,Planning_général!$E$47:$F$54,2,0))","v":""},null,null,null,"Du",{"$f":"(R5)+($L$2)*7-WEEKDAY(Q5,2)+1","v":"2019-09-09"},null,null,null,null,null,null,null,null,null,null,null,null,null,null,null,null,null,null,null,null,null,null,null,null,null,null,null,null,null,null,null,null,null,null,null,null,null,null,"Semaines"]
[null,null,null,"J2","08 h 00 - 12 h 00 / 13 h00 - 16 h 00",null,"Pause 10h-10h10 / 15h-15h10",null,{"$f":"IF(R35=\"\",\"\",R35)","v":""},null,null,{"$f":"IF(I7=\"\",\"\",VLOOKUP(I7,Planning_général!$E$47:$F$54,2,0))","v":""},null,null,null,"Au",{"$f":"Q6+6","v":"2019-09-15"},null,null,null,null,null,null,null,null,null,null,null,null,null,null,null,null,null,null,null,null,null,null,null,null,null,null,null,null,null,null,null,null,null,null,null,null,null,null,1]
[null,null,null,null,null,null,null,null,{"$f":"IF(R36=\"\",\"\",R36)","v":""},null,null,{"$f":"IF(I8=\"\",\"\",VLOOKUP(I8,Planning_général!$E$47:$F$54,2,0))","v":""},null,null,null,null,null,null,null,null,null,null,null,null,null,null,null,null,null,null,null,null,null,null,null,null,null,null,null,null,null,null,null,null,null,"Code",null,null,null,null,null,null,null,null,null,2]
[null,"Matin",null,"M1","6 h 00 - 13 h 00 ",null,"Pause 09 h 00 - 09 h 20",null,{"$f":"IF(R40=\"\",\"\",R40)","v":""},null,null,{"$f":"IF(I9=\"\",\"\",VLOOKUP(I9,Planning_général!$E$47:$F$54,2,0))","v":""},null,null,null,null,null,null,null,null,null,"Code",{"$f":"IF(VLOOKUP(W3,Planning_général!$E$17:$F$62,2,0)=0,\"Cde abs\",VLOOKUP(W3,Planning_général!$E$17:$F$62,2,0))","v":9329},{"$f":"IF(VLOOKUP(X3,Planning_général!$E$17:$F$62,2,0)=0,\"Cde abs\",VLOOKUP(X3,Planning_général!$E$17:$F$62,2,0))","v":7754},{"$f":"IF(VLOOKUP(Y3,Planning_général!$E$17:$F$62,2,0)=0,\"Cde abs\",VLOOKUP(Y3,Planning_général!$E$17:$F$62,2,0))","v":3658},{"$f":"IF(VLOOKUP(Z3,Planning_général!$E$17:$F$62,2,0)=0,\"Cde abs\",VLOOKUP(Z3,Planning_général!$E$17:$F$62,2,0))","v":8314},{"$f":"IF(VLOOKUP(AA3,Planning_général!$E$17:$F$62,2,0)=0,\"Cde abs\",VLOOKUP(AA3,Planning_général!$E$17:$F$62,2,0))","v":{"$error":"#N/A"}},{"$f":"IF(VLOOKUP(AB3,Planning_général!$E$17:$F$62,2,0)=0,\"Cde abs\",VLOOKUP(AB3,Planning_général!$E$17:$F$62,2,0))","v":{"$error":"#N/A"}},{"$f":"IF(VLOOKUP(AC3,Planning_général!$E$17:$F$62,2,0)=0,\"Cde abs\",VLOOKUP(AC3,Planning_général!$E$17:$F$62,2,0))","v":{"$error":"#N/A"}},{"$f":"IF(VLOOKUP(AD3,Planning_général!$E$17:$F$62,2,0)=0,\"Cde abs\",VLOOKUP(AD3,Planning_général!$E$17:$F$62,2,0))","v":{"$error":"#N/A"}},{"$f":"IF(VLOOKUP(AE3,Planning_général!$E$17:$F$62,2,0)=0,\"Cde abs\",VLOOKUP(AE3,Planning_général!$E$17:$F$62,2,0))","v":{"$error":"#N/A"}},{"$f":"IF(VLOOKUP(AF3,Planning_général!$E$17:$F$62,2,0)=0,\"Cde abs\",VLOOKUP(AF3,Planning_général!$E$17:$F$62,2,0))","v":{"$error":"#N/A"}},{"$f":"IF(VLOOKUP(AG3,Planning_général!$E$17:$F$62,2,0)=0,\"Cde abs\",VLOOKUP(AG3,Planning_général!$E$17:$F$62,2,0))","v":{"$error":"#N/A"}},{"$f":"IF(VLOOKUP(AH3,Planning_général!$E$17:$F$62,2,0)=0,\"Cde abs\",VLOOKUP(AH3,Planning_général!$E$17:$F$62,2,0))","v":{"$error":"#N/A"}},{"$f":"IF(VLOOKUP(AI3,Planning_général!$E$17:$F$62,2,0)=0,\"Cde abs\",VLOOKUP(AI3,Planning_général!$E$17:$F$62,2,0))","v":{"$error":"#N/A"}},{"$f":"IF(VLOOKUP(AJ3,Planning_général!$E$17:$F$62,2,0)=0,\"Cde abs\",VLOOKUP(AJ3,Planning_général!$E$17:$F$62,2,0))","v":{"$error":"#N/A"}},{"$f":"IF(AK3=0,\"\",IF(VLOOKUP(AK3,Planning_général!$E$17:$F$62,2,0)=0,\"Cde abs\",VLOOKUP(AK3,Planning_général!$E$17:$F$62,2,0)))","v":""},null,null,null,"Code","Descriptif","Horaires","Pause",null,"CP",null,null,null,null,null,null,null,null,null,3]
[null,null,null,null,null,null,null,null,{"$f":"IF(R41=\"\",\"\",R41)","v":""},null,null,{"$f":"IF(I10=\"\",\"\",VLOOKUP(I10,Planning_général!$E$47:$F$54,2,0))","v":""},null,null,null,null,null,null,null,null,{"$f":"Planning_général!G10","v":"M"},{"$f":"VLOOKUP(U10,Planning_général!$NV$20:$NW$26,2,0)","v":"Mardi"},{"$f":"VLOOKUP(W3,Planning_général!$E$47:$NM$47,((($L$2*7)+2)-6),0)","v":0},{"$f":"IF(ISNA(VLOOKUP(X3,Planning_général!$E$48:$NM$48,((($L$2*7)+2)-6),0)),0,VLOOKUP(X3,Planning_général!$E$48:$NM$48,((($L$2*7)+2)-6),0))","v":0},{"$f":"VLOOKUP(Y3,Planning_général!$E$49:$NM$49,((($L$2*7)+2)-6),0)","v":0},{"$f":"VLOOKUP(Z3,Planning_général!$E$50:$NM$50,((($L$2*7)+2)-6),0)","v":0},{"$f":"VLOOKUP(AA3,Planning_général!$E$51:$NM$51,((($L$2*7)+2)-6),0)","v":{"$error":"#N/A"}},{"$f":"VLOOKUP(AB3,Planning_général!$E$52:$NM$52,((($L$2*7)+2)-6),0)","v":{"$error":"#N/A"}},{"$f":"VLOOKUP($AC$3,Planning_général!$E$53:$NM$53,((($L$2*7)+2)-6),0)","v":{"$error":"#N/A"}},{"$f":"VLOOKUP($AD$3,Planning_général!$E$54:$NM$54,((($L$2*7)+2)-6),0)","v":{"$error":"#N/A"}},{"$f":"VLOOKUP($AE$3,Planning_général!$E$25:$NM$25,((($L$2*7)+2)-6),0)","v":{"$error":"#N/A"}},{"$f":"VLOOKUP($AF$3,Planning_général!$E$26:$NM$26,((($L$2*7)+2)-6),0)","v":{"$error":"#N/A"}},{"$f":"VLOOKUP($AG$3,Planning_général!$E$27:$NM$27,((($L$2*7)+2)-6),0)","v":{"$error":"#N/A"}},{"$f":"VLOOKUP($AH$3,Planning_général!$E$28:$NM$28,((($L$2*7)+2)-6),0)","v":{"$error":"#N/A"}},{"$f":"VLOOKUP($AI$3,Planning_général!$E$29:$NM$29,((($L$2*7)+2)-6),0)","v":{"$error":"#N/A"}},{"$f":"VLOOKUP($AJ$3,Planning_général!$E$30:$NM$30,((($L$2*7)+2)-6),0)","v":{"$error":"#N/A"}},{"$f":"IF(ISNA(VLOOKUP($AK$3,Planning_général!$E$31:$NM$31,((($L$2*7)+2)-6),0)),0,VLOOKUP($AK$3,Planning_général!$E$31:$NM$31,((($L$2*7)+2)-6),0))","v":0},null,null,null,"M1","Matin","6 h 00 - 13 h 00 ","09 h 00 - 09 h 20",null,"Recup",null,null,null,null,null,null,null,null,null,4]
[null,null,null,"M2","6 h 00 - 09 h 00 ",null,"Pause 08 h 00 - 08 h 20",null,{"$f":"IF(R45=\"\",\"\",R45)","v":""},null,null,{"$f":"IF(I11=\"\",\"\",VLOOKUP(I11,Planning_général!$E$47:$F$54,2,0))","v":""},null,null,null,{"$f":"Q6","v":"2019-09-09"},{"$f":"DAY(P11)","v":9},{"$f":"MONTH(P11)","v":9},{"$f":"YEAR(P11)","v":2019},null,{"$f":"Planning_général!H10","v":"Me"},{"$f":"VLOOKUP(U11,Planning_général!$NV$20:$NW$26,2,0)","v":"Mercredi"},{"$f":"VLOOKUP($W$3,Planning_général!$E$47:$NM$47,((($L$2*7)+2)-5),0)","v":0},{"$f":"VLOOKUP($X$3,Planning_général!$E$48:$NM$48,((($L$2*7)+2)-5),0)","v":0},{"$f":"VLOOKUP($Y$3,Planning_général!$E$49:$NM$49,((($L$2*7)+2)-5),0)","v":0},{"$f":"VLOOKUP($Z$3,Planning_général!$E$50:$NM$50,((($L$2*7)+2)-5),0)","v":0},{"$f":"VLOOKUP($AA$3,Planning_général!$E$51:$NM$51,((($L$2*7)+2)-5),0)","v":{"$error":"#N/A"}},{"$f":"VLOOKUP($AB$3,Planning_général!$E$52:$NM$52,((($L$2*7)+2)-5),0)","v":{"$error":"#N/A"}},{"$f":"VLOOKUP($AC$3,Planning_général!$E$53:$NM$53,((($L$2*7)+2)-5),0)","v":{"$error":"#N/A"}},{"$f":"VLOOKUP($AD$3,Planning_général!$E$54:$NM$54,((($L$2*7)+2)-5),0)","v":{"$error":"#N/A"}},{"$f":"VLOOKUP($AE$3,Planning_général!$E$25:$NM$25,((($L$2*7)+2)-5),0)","v":{"$error":"#N/A"}},{"$f":"VLOOKUP($AF$3,Planning_général!$E$26:$NM$26,((($L$2*7)+2)-5),0)","v":{"$error":"#N/A"}},{"$f":"VLOOKUP($AG$3,Planning_général!$E$27:$NM$27,((($L$2*7)+2)-5),0)","v":{"$error":"#N/A"}},{"$f":"VLOOKUP($AH$3,Planning_général!$E$28:$NM$28,((($L$2*7)+2)-5),0)","v":{"$error":"#N/A"}},{"$f":"VLOOKUP($AI$3,Planning_général!$E$29:$NM$29,((($L$2*7)+2)-5),0)","v":{"$error":"#N/A"}},{"$f":"VLOOKUP($AJ$3,Planning_général!$E$30:$NM$30,((($L$2*7)+2)-5),0)","v":{"$error":"#N/A"}},{"$f":"IF(ISNA(VLOOKUP($AK$3,Planning_général!$E$31:$NM$31,((($L$2*7)+2)-5),0)),0,VLOOKUP($AK$3,Planning_général!$E$31:$NM$31,((($L$2*7)+2)-5),0))","v":0},null,null,null,"M2","Matin","6 h 00 - 09 h 00 ","08 h 00 - 08 h 20",null,"Form",null,null,null,null,null,null,null,null,null,5]
[null,null,null,null,null,null,null,null,{"$f":"IF(R46=\"\",\"\",R46)","v":""},null,null,{"$f":"IF(I12=\"\",\"\",VLOOKUP(I12,Planning_général!$E$47:$F$54,2,0))","v":""},null,null,null,{"$f":"Q7","v":"2019-09-15"},{"$f":"DAY(P12)","v":15},{"$f":"MONTH(P12)","v":9},{"$f":"YEAR(P12)","v":2019},null,{"$f":"Planning_général!I10","v":"J"},{"$f":"VLOOKUP(U12,Planning_général!$NV$20:$NW$26,2,0)","v":"Jeudi"},{"$f":"VLOOKUP($W$3,Planning_général!$E$47:$NM$47,((($L$2*7)+2)-4),0)","v":0},{"$f":"VLOOKUP($X$3,Planning_général!$E$48:$NM$48,((($L$2*7)+2)-4),0)","v":0},{"$f":"VLOOKUP($Y$3,Planning_général!$E$49:$NM$49,((($L$2*7)+2)-4),0)","v":0},{"$f":"VLOOKUP($Z$3,Planning_général!$E$50:$NM$50,((($L$2*7)+2)-4),0)","v":0},{"$f":"VLOOKUP($AA$3,Planning_général!$E$51:$NM$51,((($L$2*7)+2)-4),0)","v":{"$error":"#N/A"}},{"$f":"VLOOKUP($AB$3,Planning_général!$E$52:$NM$52,((($L$2*7)+2)-4),0)","v":{"$error":"#N/A"}},{"$f":"VLOOKUP($AC$3,Planning_général!$E$53:$NM$53,((($L$2*7)+2)-4),0)","v":{"$error":"#N/A"}},{"$f":"VLOOKUP($AD$3,Planning_général!$E$54:$NM$54,((($L$2*7)+2)-4),0)","v":{"$error":"#N/A"}},{"$f":"VLOOKUP($AE$3,Planning_général!$E$25:$NM$25,((($L$2*7)+2)-4),0)","v":{"$error":"#N/A"}},{"$f":"VLOOKUP($AF$3,Planning_général!$E$26:$NM$26,((($L$2*7)+2)-4),0)","v":{"$error":"#N/A"}},{"$f":"VLOOKUP($AG$3,Planning_général!$E$27:$NM$27,((($L$2*7)+2)-4),0)","v":{"$error":"#N/A"}},{"$f":"VLOOKUP($AH$3,Planning_général!$E$28:$NM$28,((($L$2*7)+2)-4),0)","v":{"$error":"#N/A"}},{"$f":"VLOOKUP($AI$3,Planning_général!$E$29:$NM$29,((($L$2*7)+2)-4),0)","v":{"$error":"#N/A"}},{"$f":"VLOOKUP($AJ$3,Planning_général!$E$30:$NM$30,((($L$2*7)+2)-4),0)","v":{"$error":"#N/A"}},{"$f":"IF(ISNA(VLOOKUP($AK$3,Planning_général!$E$31:$NM$31,((($L$2*7)+2)-4),0)),0,VLOOKUP($AK$3,Planning_général!$E$31:$NM$31,((($L$2*7)+2)-4),0))","v":0},null,null,null,"M3","Matin + Samedi","05 h 00 - 12 h 00 ","-",null,"Modul",null,null,null,null,null,null,null,null,null,6]
[null,null,null,"M3","05 h 00 - 12 h 00 ",null,"-",null,null,null,null,null,null,null,null,null,null,null,null,null,{"$f":"Planning_général!J10","v":"V"},{"$f":"VLOOKUP(U13,Planning_général!$NV$20:$NW$26,2,0)","v":"Vendredi"},{"$f":"VLOOKUP($W$3,Planning_général!$E$47:$NM$47,((($L$2*7)+2)-3),0)","v":0},{"$f":"VLOOKUP($X$3,Planning_général!$E$48:$NM$48,((($L$2*7)+2)-3),0)","v":0},{"$f":"VLOOKUP($Y$3,Planning_général!$E$49:$NM$49,((($L$2*7)+2)-3),0)","v":0},{"$f":"VLOOKUP($Z$3,Planning_général!$E$50:$NM$50,((($L$2*7)+2)-3),0)","v":0},{"$f":"VLOOKUP($AA$3,Planning_général!$E$51:$NM$51,((($L$2*7)+2)-3),0)","v":{"$error":"#N/A"}},{"$f":"VLOOKUP($AB$3,Planning_général!$E$52:$NM$52,((($L$2*7)+2)-3),0)","v":{"$error":"#N/A"}},{"$f":"VLOOKUP($AC$3,Planning_général!$E$53:$NM$53,((($L$2*7)+2)-3),0)","v":{"$error":"#N/A"}},{"$f":"VLOOKUP($AD$3,Planning_général!$E$54:$NM$54,((($L$2*7)+2)-3),0)","v":{"$error":"#N/A"}},{"$f":"VLOOKUP($AE$3,Planning_général!$E$25:$NM$25,((($L$2*7)+2)-3),0)","v":{"$error":"#N/A"}},{"$f":"VLOOKUP($AF$3,Planning_général!$E$26:$NM$26,((($L$2*7)+2)-3),0)","v":{"$error":"#N/A"}},{"$f":"VLOOKUP($AG$3,Planning_général!$E$27:$NM$27,((($L$2*7)+2)-3),0)","v":{"$error":"#N/A"}},{"$f":"VLOOKUP($AH$3,Planning_général!$E$28:$NM$28,((($L$2*7)+2)-3),0)","v":{"$error":"#N/A"}},{"$f":"VLOOKUP($AI$3,Planning_général!$E$29:$NM$29,((($L$2*7)+2)-3),0)","v":{"$error":"#N/A"}},{"$f":"VLOOKUP($AJ$3,Planning_général!$E$30:$NM$30,((($L$2*7)+2)-3),0)","v":{"$error":"#N/A"}},{"$f":"IF(ISNA(VLOOKUP($AK$3,Planning_général!$E$31:$NM$31,((($L$2*7)+2)-3),0)),0,VLOOKUP($AK$3,Planning_général!$E$31:$NM$31,((($L$2*7)+2)-3),0))","v":0},null,null,null,"J1","Journee","08 h 00 - 12 h 00 / 13 h00 - 16 h 00","10 h 00 -10 h 10 / 15 h 00 -15 h 10",null,"H.R",null,null,null,null,null,null,null,null,null,7]
[null,null,null,null,null,null,null,null,{"$f":"IF(R51=\"\",\"\",R51)","v":""},null,null,{"$f":"IF(I14=\"\",\"\",VLOOKUP(I14,Planning_général!$E$47:$F$54,2,0))","v":""},null,null,null,null,null,null,null,null,{"$f":"Planning_général!K10","v":"S"},{"$f":"VLOOKUP(U14,Planning_général!$NV$20:$NW$26,2,0)","v":"Samedi"},{"$f":"VLOOKUP($W$3,Planning_général!$E$47:$NM$47,((($L$2*7)+2)-2),0)","v":0},{"$f":"VLOOKUP($X$3,Planning_général!$E$48:$NM$48,((($L$2*7)+2)-2),0)","v":0},{"$f":"VLOOKUP($Y$3,Planning_général!$E$49:$NM$49,((($L$2*7)+2)-2),0)","v":0},{"$f":"VLOOKUP($Z$3,Planning_général!$E$50:$NM$50,((($L$2*7)+2)-2),0)","v":0},{"$f":"VLOOKUP($AA$3,Planning_général!$E$51:$NM$51,((($L$2*7)+2)-2),0)","v":{"$error":"#N/A"}},{"$f":"VLOOKUP($AB$3,Planning_général!$E$52:$NM$52,((($L$2*7)+2)-2),0)","v":{"$error":"#N/A"}},{"$f":"VLOOKUP($AC$3,Planning_général!$E$53:$NM$53,((($L$2*7)+2)-2),0)","v":{"$error":"#N/A"}},{"$f":"VLOOKUP($AD$3,Planning_général!$E$54:$NM$54,((($L$2*7)+2)-2),0)","v":{"$error":"#N/A"}},{"$f":"VLOOKUP($AE$3,Planning_général!$E$25:$NM$25,((($L$2*7)+2)-2),0)","v":{"$error":"#N/A"}},{"$f":"VLOOKUP($AF$3,Planning_général!$E$26:$NM$26,((($L$2*7)+2)-2),0)","v":{"$error":"#N/A"}},{"$f":"VLOOKUP($AG$3,Planning_général!$E$27:$NM$27,((($L$2*7)+2)-2),0)","v":{"$error":"#N/A"}},{"$f":"VLOOKUP($AH$3,Planning_général!$E$28:$NM$28,((($L$2*7)+2)-2),0)","v":{"$error":"#N/A"}},{"$f":"VLOOKUP($AI$3,Planning_général!$E$29:$NM$29,((($L$2*7)+2)-2),0)","v":{"$error":"#N/A"}},{"$f":"VLOOKUP($AJ$3,Planning_général!$E$30:$NM$30,((($L$2*7)+2)-2),0)","v":{"$error":"#N/A"}},{"$f":"IF(ISNA(VLOOKUP($AK$3,Planning_général!$E$31:$NM$31,((($L$2*7)+2)-2),0)),0,VLOOKUP($AK$3,Planning_général!$E$31:$NM$31,((($L$2*7)+2)-2),0))","v":0},null,null,null,"J2","Journee + Samedi","08 h 00 - 12 h 00 / 13 h00 - 16 h 00","10h-10h10 / 15h-15h10",null,"HR Nuit",null,null,null,null,null,null,null,null,null,8]
[null,"Après-midi",null,"AP1","12 h 00 - 19 h 00 ",null,"Pause 13 h 30 - 15 h 50",null,null,null,null,null,null,null,null,null,null,null,null,null,{"$f":"Planning_général!L10","v":"D"},{"$f":"VLOOKUP(U15,Planning_général!$NV$20:$NW$26,2,0)","v":"Dimanche"},{"$f":"VLOOKUP($W$3,Planning_général!$E$47:$NM$47,((($L$2*7)+2)-1),0)","v":0},{"$f":"VLOOKUP($X$3,Planning_général!$E$48:$NM$48,((($L$2*7)+2)-1),0)","v":0},{"$f":"VLOOKUP($Y$3,Planning_général!$E$49:$NM$49,((($L$2*7)+2)-1),0)","v":0},{"$f":"VLOOKUP($Z$3,Planning_général!$E$50:$NM$50,((($L$2*7)+2)-1),0)","v":0},{"$f":"VLOOKUP($AA$3,Planning_général!$E$51:$NM$51,((($L$2*7)+2)-1),0)","v":{"$error":"#N/A"}},{"$f":"VLOOKUP($AB$3,Planning_général!$E$52:$NM$52,((($L$2*7)+2)-1),0)","v":{"$error":"#N/A"}},{"$f":"VLOOKUP($AC$3,Planning_général!$E$53:$NM$53,((($L$2*7)+2)-1),0)","v":{"$error":"#N/A"}},{"$f":"VLOOKUP($AD$3,Planning_général!$E$54:$NM$54,((($L$2*7)+2)-1),0)","v":{"$error":"#N/A"}},{"$f":"VLOOKUP($AE$3,Planning_général!$E$25:$NM$25,((($L$2*7)+2)-1),0)","v":{"$error":"#N/A"}},{"$f":"VLOOKUP($AF$3,Planning_général!$E$26:$NM$26,((($L$2*7)+2)-1),0)","v":{"$error":"#N/A"}},{"$f":"VLOOKUP($AG$3,Planning_général!$E$27:$NM$27,((($L$2*7)+2)-1),0)","v":{"$error":"#N/A"}},{"$f":"VLOOKUP($AH$3,Planning_général!$E$28:$NM$28,((($L$2*7)+2)-1),0)","v":{"$error":"#N/A"}},{"$f":"VLOOKUP($AI$3,Planning_général!$E$29:$NM$29,((($L$2*7)+2)-1),0)","v":{"$error":"#N/A"}},{"$f":"VLOOKUP($AJ$3,Planning_général!$E$30:$NM$30,((($L$2*7)+2)-1),0)","v":{"$error":"#N/A"}},{"$f":"IF(ISNA(VLOOKUP($AK$3,Planning_général!$E$31:$NM$31,((($L$2*7)+2)-1),0)),0,VLOOKUP($AK$3,Planning_général!$E$31:$NM$31,((($L$2*7)+2)-1),0))","v":0},null,null,null,"AP1","Après-midi 1","12 h 00 - 19 h 00 ","13 h 30 - 15 h 50",null,"RTT",null,null,null,null,null,null,null,null,null,9]
[null,null,null,null,null,null,null,null,{"$f":"IF(R56=\"\",\"\",R56)","v":""},null,null,{"$f":"IF(I16=\"\",\"\",VLOOKUP(I16,Planning_général!$E$47:$F$54,2,0))","v":""},null,null,null,null,null,null,null,null,{"$f":"Planning_général!M10","v":"L"},{"$f":"VLOOKUP(U16,Planning_général!$NV$20:$NW$26,2,0)","v":"Lundi"},{"$f":"VLOOKUP($W$3,Planning_général!$E$47:$NM$47,((($L$2*7)+2)-0),0)","v":0},{"$f":"VLOOKUP($X$3,Planning_général!$E$48:$NM$48,((($L$2*7)+2)-0),0)","v":0},{"$f":"VLOOKUP($Y$3,Planning_général!$E$49:$NM$49,((($L$2*7)+2)-0),0)","v":0},{"$f":"VLOOKUP($Z$3,Planning_général!$E$50:$NM$50,((($L$2*7)+2)-0),0)","v":0},{"$f":"VLOOKUP($AA$3,Planning_général!$E$51:$NM$51,((($L$2*7)+2)-0),0)","v":{"$error":"#N/A"}},{"$f":"VLOOKUP($AB$3,Planning_général!$E$52:$NM$52,((($L$2*7)+2)-0),0)","v":{"$error":"#N/A"}},{"$f":"VLOOKUP($AC$3,Planning_général!$E$53:$NM$53,((($L$2*7)+2)-0),0)","v":{"$error":"#N/A"}},{"$f":"VLOOKUP($AD$3,Planning_général!$E$54:$NM$54,((($L$2*7)+2)-0),0)","v":{"$error":"#N/A"}},{"$f":"VLOOKUP($AE$3,Planning_général!$E$25:$NM$25,((($L$2*7)+2)-0),0)","v":{"$error":"#N/A"}},{"$f":"VLOOKUP($AF$3,Planning_général!$E$26:$NM$26,((($L$2*7)+2)-0),0)","v":{"$error":"#N/A"}},{"$f":"VLOOKUP($AG$3,Planning_général!$E$27:$NM$27,((($L$2*7)+2)-0),0)","v":{"$error":"#N/A"}},{"$f":"VLOOKUP($AH$3,Planning_général!$E$28:$NM$28,((($L$2*7)+2)-0),0)","v":{"$error":"#N/A"}},{"$f":"VLOOKUP($AI$3,Planning_général!$E$29:$NM$29,((($L$2*7)+2)-0),0)","v":{"$error":"#N/A"}},{"$f":"VLOOKUP($AJ$3,Planning_général!$E$30:$NM$30,((($L$2*7)+2)-0),0)","v":{"$error":"#N/A"}},{"$f":"IF(ISNA(VLOOKUP($AK$3,Planning_général!$E$31:$NM$31,((($L$2*7)+2)-0),0)),0,VLOOKUP($AK$3,Planning_général!$E$31:$NM$31,((($L$2*7)+2)-0),0))","v":0},null,null,null,"AP2","Après-midi 2","18 h 30 - 01 h 30 ","21 h 00 - 21 h 20",null,"Mal",null,null,null,null,null,null,null,null,null,10]
[null,null,null,"AP2","18 h 30 - 01 h 30 ",null,"Pause 21 h 00 - 21 h 20",null,{"$f":"IF(R60=\"\",\"\",R60)","v":""},null,null,{"$f":"IF(I17=\"\",\"\",VLOOKUP(I17,Planning_général!$E$47:$F$54,2,0))","v":""},null,null,null,null,null,null,null,null,null,null,null,null,null,null,null,null,null,null,null,null,null,null,null,null,null,null,null,null,null,null,null,null,null,"J.A",null,null,null,null,null,null,null,null,null,11]
[null,null,null,null,null,null,null,null,{"$f":"IF(R61=\"\",\"\",R61)","v":""},null,null,{"$f":"IF(I18=\"\",\"\",VLOOKUP(I18,Planning_général!$E$47:$F$54,2,0))","v":""},null,null,null,null,null,null,null,null,null,null,null,null,null,null,null,null,null,null,null,null,null,null,null,null,null,null,null,null,null,null,null,null,null,"Ecole",null,null,null,null,null,null,null,null,null,12]
[null,null,null,null,null,null,null,null,null,null,null,null,null,null,null,null,null,null,null,null,null,{"$f":"AO10","v":"M1"},{"$f":"IF(COUNTIF($W$10:$W$16,V19)=0,\"\",COUNTIF($W$10:$W$16,V19))","v":""},{"$f":"IF(COUNTIF($X$10:$X$16,V19)=0,\"\",COUNTIF($X$10:$X$16,V19))","v":""},{"$f":"IF(COUNTIF($Y$10:$Y$16,V19)=0,\"\",COUNTIF($Y$10:$Y$16,V19))","v":""},{"$f":"IF(COUNTIF($Z$10:$Z$16,V19)=0,\"\",COUNTIF($Z$10:$Z$16,V19))","v":""},{"$f":"IF(COUNTIF($AA$10:$AA$16,V19)=0,\"\",COUNTIF($AA$10:$AA$16,V19))","v":""},{"$f":"IF(COUNTIF($AB$10:$AB$16,V19)=0,\"\",COUNTIF($AB$10:$AB$16,V19))","v":""},{"$f":"IF(COUNTIF($AC$10:$AC$16,V19)=0,\"\",COUNTIF($AC$10:$AC$16,V19))","v":""},{"$f":"IF(COUNTIF($AD$10:$AD$16,$V$19)=0,\"\",COUNTIF($AD$10:$AD$16,$V$19))","v":""},{"$f":"IF(COUNTIF($AE$10:$AE$16,$V$19)=0,\"\",COUNTIF($AE$10:$AE$16,$V$19))","v":""},{"$f":"IF(COUNTIF($AF$10:$AF$16,$V$19)=0,\"\",COUNTIF($AF$10:$AF$16,$V$19))","v":""},{"$f":"IF(COUNTIF($AG$10:$AG$16,$V$19)=0,\"\",COUNTIF($AG$10:$AG$16,$V$19))","v":""},{"$f":"IF(COUNTIF($AH$10:$AH$16,$V$19)=0,\"\",COUNTIF($AH$10:$AH$16,$V$19))","v":""},{"$f":"IF(COUNTIF($AI$10:$AI$16,$V$19)=0,\"\",COUNTIF($AI$10:$AI$16,$V$19))","v":""},{"$f":"IF(COUNTIF($AJ$10:$AJ$16,$V$19)=0,\"\",COUNTIF($AJ$10:$AJ$16,$V$19))","v":""},{"$f":"IF(COUNTIF($AK$10:$AK$16,$V$19)=0,\"\",COUNTIF($AK$10:$AK$16,$V$19))","v":""},null,null,null,null,null,null,null,null,null,null,null,null,null,null,null,null,null,null,13]
[null,"Absences (CP/ Modul/      Repos       /Formation)",null,null,"Lundi",{"$f":"VLOOKUP(E20,$O$71:$S$77,3,0)","v":""},null,null,null,null,null,null,null,null,null,null,null,null,null,null,null,"M2",{"$f":"IF(COUNTIF($W$10:$W$16,V20)=0,\"\",COUNTIF($W$10:$W$16,V20))","v":""},{"$f":"IF(COUNTIF($X$10:$X$16,V20)=0,\"\",COUNTIF($X$10:$X$16,V20))","v":""},{"$f":"IF(COUNTIF($Y$10:$Y$16,V20)=0,\"\",COUNTIF($Y$10:$Y$16,V20))","v":""},{"$f":"IF(COUNTIF($Z$10:$Z$16,V20)=0,\"\",COUNTIF($Z$10:$Z$16,V20))","v":""},{"$f":"IF(COUNTIF($AA$10:$AA$16,V20)=0,\"\",COUNTIF($AA$10:$AA$16,V20))","v":""},{"$f":"IF(COUNTIF($AB$10:$AB$16,V20)=0,\"\",COUNTIF($AB$10:$AB$16,V20))","v":""},{"$f":"IF(COUNTIF($AC$10:$AC$16,V20)=0,\"\",COUNTIF($AC$10:$AC$16,V20))","v":""},{"$f":"IF(COUNTIF($AD$10:$AD$16,$V$20)=0,\"\",COUNTIF($AD$10:$AD$16,$V$20))","v":""},{"$f":"IF(COUNTIF($AE$10:$AE$16,$V$20)=0,\"\",COUNTIF($AE$10:$AE$16,$V$20))","v":""},{"$f":"IF(COUNTIF($AF$10:$AF$16,$V$20)=0,\"\",COUNTIF($AF$10:$AF$16,$V$20))","v":""},{"$f":"IF(COUNTIF($AG$10:$AG$16,$V$20)=0,\"\",COUNTIF($AG$10:$AG$16,$V$20))","v":""},{"$f":"IF(COUNTIF($AH$10:$AH$16,$V$20)=0,\"\",COUNTIF($AH$10:$AH$16,$V$20))","v":""},{"$f":"IF(COUNTIF($AI$10:$AI$16,$V$20)=0,\"\",COUNTIF($AI$10:$AI$16,$V$20))","v":""},{"$f":"IF(COUNTIF($AJ$10:$AJ$16,$V$20)=0,\"\",COUNTIF($AJ$10:$AJ$16,$V$20))","v":""},{"$f":"IF(COUNTIF($AK$10:$AK$16,$V$20)=0,\"\",COUNTIF($AK$10:$AK$16,$V$20))","v":""},null,null,null,null,null,null,null,null,null,null,null,null,null,null,null,null,null,null,14]
[null,null,null,null,"Mardi",{"$f":"VLOOKUP(E21,$O$71:$S$77,3,0)","v":""},null,null,null,null,null,null,null,null,null,null,null,null,null,null,null,"M3","","","","","","",{"$f":"IF(COUNTIF($AC$10:$AC$16,V21)=0,\"\",COUNTIF($AC$10:$AC$16,V21))","v":""},{"$f":"IF(COUNTIF($AC$10:$AC$16,V21)=0,\"\",COUNTIF($AC$10:$AC$16,V21))","v":""},{"$f":"IF(COUNTIF($AE$10:$AE$16,$V$21)=0,\"\",COUNTIF($AE$10:$AE$16,$V$21))","v":""},{"$f":"IF(COUNTIF($AF$10:$AF$16,$V$21)=0,\"\",COUNTIF($AF$10:$AF$16,$V$21))","v":""},{"$f":"IF(COUNTIF($AG$10:$AG$16,$V$21)=0,\"\",COUNTIF($AG$10:$AG$16,$V$21))","v":""},{"$f":"IF(COUNTIF($AH$10:$AH$16,$V$21)=0,\"\",COUNTIF($AH$10:$AH$16,$V$21))","v":""},{"$f":"IF(COUNTIF($AI$10:$AI$16,$V$21)=0,\"\",COUNTIF($AI$10:$AI$16,$V$21))","v":""},{"$f":"IF(COUNTIF($AJ$10:$AJ$16,$V$21)=0,\"\",COUNTIF($AJ$10:$AJ$16,$V$21))","v":""},{"$f":"IF(COUNTIF($AK$10:$AK$16,$V$21)=0,\"\",COUNTIF($AK$10:$AK$16,$V$21))","v":""},null,null,null,null,null,null,null,null,null,null,null,null,null,null,null,null,null,null,15]
[null,null,null,null,"Mercredi","",null,null,null,null,null,null,null,null,null,null,null,null,null,null,null,"J1","","","","","","","",{"$f":"IF(COUNTIF($AD$10:$AD$16,$V$22)=0,\"\",COUNTIF($AD$10:$AD$16,$V$22))","v":""},{"$f":"IF(COUNTIF($AE$10:$AE$16,$V$22)=0,\"\",COUNTIF($AE$10:$AE$16,$V$22))","v":""},{"$f":"IF(COUNTIF($AF$10:$AF$16,$V$22)=0,\"\",COUNTIF($AF$10:$AF$16,$V$22))","v":""},{"$f":"IF(COUNTIF($AG$10:$AG$16,$V$22)=0,\"\",COUNTIF($AG$10:$AG$16,$V$22))","v":""},{"$f":"IF(COUNTIF($AH$10:$AH$16,$V$22)=0,\"\",COUNTIF($AH$10:$AH$16,$V$22))","v":""},{"$f":"IF(COUNTIF($AI$10:$AI$16,$V$22)=0,\"\",COUNTIF($AI$10:$AI$16,$V$22))","v":""},{"$f":"IF(COUNTIF($AJ$10:$AJ$16,$V$22)=0,\"\",COUNTIF($AJ$10:$AJ$16,$V$22))","v":""},{"$f":"IF(COUNTIF($AK$10:$AK$16,$V$22)=0,\"\",COUNTIF($AK$10:$AK$16,$V$22))","v":""},null,null,null,null,null,null,null,null,null,null,null,null,null,null,null,null,null,null,16]
[null,null,null,null,"Jeudi","",null,null,null,null,null,null,null,null,null,null,null,null,null,null,null,"J2","","","","","","",{"$f":"IF(COUNTIF($AC$10:$AC$16,$V$23)=0,\"\",COUNTIF($AC$10:$AC$16,V23))","v":""},{"$f":"IF(COUNTIF($AD$10:$AD$16,$V$23)=0,\"\",COUNTIF($AD$10:$AD$16,$V$23))","v":""},{"$f":"IF(COUNTIF($AE$10:$AE$16,$V$23)=0,\"\",COUNTIF($AE$10:$AE$16,$V$23))","v":""},{"$f":"IF(COUNTIF($AF$10:$AF$16,$V$23)=0,\"\",COUNTIF($AF$10:$AF$16,$V$23))","v":""},{"$f":"IF(COUNTIF($AG$10:$AG$16,$V$23)=0,\"\",COUNTIF($AG$10:$AG$16,$V$23))","v":""},{"$f":"IF(COUNTIF($AH$10:$AH$16,$V$23)=0,\"\",COUNTIF($AH$10:$AH$16,$V$23))","v":""},{"$f":"IF(COUNTIF($AI$10:$AI$16,$V$23)=0,\"\",COUNTIF($AI$10:$AI$16,$V$23))","v":""},{"$f":"IF(COUNTIF($AJ$10:$AJ$16,$V$23)=0,\"\",COUNTIF($AJ$10:$AJ$16,$V$23))","v":""},{"$f":"IF(COUNTIF($AK$10:$AK$16,$V$23)=0,\"\",COUNTIF($AK$10:$AK$16,$V$23))","v":""},null,null,null,null,null,null,null,null,null,null,null,null,null,null,null,null,null,null,17]
[null,null,null,null,"Vendredi","",null,null,null,null,null,null,null,null,null,null,null,null,null,null,null,"AP1","","","","","","",{"$f":"IF(COUNTIF($AC$10:$AC$16,$V$24)=0,\"\",COUNTIF($AC$10:$AC$16,V24))","v":""},{"$f":"IF(COUNTIF($AD$10:$AD$16,$V$24)=0,\"\",COUNTIF($AD$10:$AD$16,$V$24))","v":""},{"$f":"IF(COUNTIF($AE$10:$AE$16,$V$24)=0,\"\",COUNTIF($AE$10:$AE$16,$V$24))","v":""},{"$f":"IF(COUNTIF($AF$10:$AF$16,$V$24)=0,\"\",COUNTIF($AF$10:$AF$16,$V$24))","v":""},{"$f":"IF(COUNTIF($AG$10:$AG$16,$V$24)=0,\"\",COUNTIF($AG$10:$AG$16,$V$24))","v":""},{"$f":"IF(COUNTIF($AH$10:$AH$16,$V$24)=0,\"\",COUNTIF($AH$10:$AH$16,$V$24))","v":""},{"$f":"IF(COUNTIF($AI$10:$AI$16,$V$24)=0,\"\",COUNTIF($AI$10:$AI$16,$V$24))","v":""},{"$f":"IF(COUNTIF($AJ$10:$AJ$16,$V$24)=0,\"\",COUNTIF($AJ$10:$AJ$16,$V$24))","v":""},{"$f":"IF(COUNTIF($AK$10:$AK$16,$V$24)=0,\"\",COUNTIF($AK$10:$AK$16,$V$24))","v":""},null,null,null,null,null,null,null,null,null,null,null,null,null,null,null,null,null,null,18]
[null,null,null,null,"Samedi","",null,null,null,null,null,null,null,null,null,null,null,null,null,null,null,"AP2","","","","","","",{"$f":"IF(COUNTIF($AC$10:$AC$16,$V$25)=0,\"\",COUNTIF($AC$10:$AC$16,V25))","v":""},{"$f":"IF(COUNTIF($AD$10:$AD$16,$V$25)=0,\"\",COUNTIF($AD$10:$AD$16,$V$25))","v":""},{"$f":"IF(COUNTIF($AE$10:$AE$16,$V$25)=0,\"\",COUNTIF($AE$10:$AE$16,$V$25))","v":""},{"$f":"IF(COUNTIF($AF$10:$AF$16,$V$25)=0,\"\",COUNTIF($AF$10:$AF$16,$V$25))","v":""},{"$f":"IF(COUNTIF($AG$10:$AG$16,$V$25)=0,\"\",COUNTIF($AG$10:$AG$16,$V$25))","v":""},{"$f":"IF(COUNTIF($AH$10:$AH$16,$V$25)=0,\"\",COUNTIF($AH$10:$AH$16,$V$25))","v":""},{"$f":"IF(COUNTIF($AI$10:$AI$16,$V$25)=0,\"\",COUNTIF($AI$10:$AI$16,$V$25))","v":""},{"$f":"IF(COUNTIF($AJ$10:$AJ$16,$V$25)=0,\"\",COUNTIF($AJ$10:$AJ$16,$V$25))","v":""},{"$f":"IF(COUNTIF($AK$10:$AK$16,$V$25)=0,\"\",COUNTIF($AK$10:$AK$16,$V$25))","v":""},null,null,null,null,null,null,null,null,null,null,null,null,null,null,null,null,null,null,19]
[null,null,null,null,null,null,null,null,null,null,null,null,null,null,null,null,null,null,null,null,null,"-","","","","","","","",{"$f":"IF(COUNTIF($AD$10:$AD$16,$V$26)=0,\"\",COUNTIF($AD$10:$AD$16,$V$26))","v":""},{"$f":"IF(COUNTIF($AE$10:$AE$16,$V$26)=0,\"\",COUNTIF($AE$10:$AE$16,$V$26))","v":""},{"$f":"IF(COUNTIF($AF$10:$AF$16,$V$26)=0,\"\",COUNTIF($AF$10:$AF$16,$V$26))","v":""},{"$f":"IF(COUNTIF($AG$10:$AG$16,$V$26)=0,\"\",COUNTIF($AG$10:$AG$16,$V$26))","v":""},{"$f":"IF(COUNTIF($AH$10:$AH$16,$V$26)=0,\"\",COUNTIF($AH$10:$AH$16,$V$26))","v":""},{"$f":"IF(COUNTIF($AI$10:$AI$16,$V$26)=0,\"\",COUNTIF($AI$10:$AI$16,$V$26))","v":""},{"$f":"IF(COUNTIF($AJ$10:$AJ$16,$V$26)=0,\"\",COUNTIF($AJ$10:$AJ$16,$V$26))","v":""},{"$f":"IF(COUNTIF($AK$10:$AK$16,$V$26)=0,\"\",COUNTIF($AK$10:$AK$16,$V$26))","v":""},null,null,null,null,null,null,null,null,null,null,null,null,null,null,null,null,null,null,20]
[null,null,null,null,null,null,null,null,null,null,null,null,null,null,null,null,null,null,null,null,null,"Max",{"$f":"MAX(W19:W25)","v":0},0,0,0,0,0,0,0,0,0,0,0,0,0,0,null,null,null,null,null,null,null,null,null,null,null,null,null,null,null,null,null,null,21]
[null,null,null,null,null,null,null,null,null,null,null,null,null,null,null,null,null,null,null,null,null,null,null,null,null,null,null,null,null,null,null,null,null,null,null,null,null,null,null,null,null,null,null,null,null,null,null,null,null,null,null,null,null,null,null,22]
[null,null,null,null,null,null,null,null,null,null,null,null,null,null,null,null,null,"Techniciens",null,null,null,null,null,null,null,null,null,null,null,null,null,null,null,null,null,null,null,null,null,null,null,null,null,null,null,null,null,null,null,null,null,null,null,null,null,23]
[null,null,null,null,null,null,null,null,null,null,null,null,null,null,null,null,null,null,null,null,null,null,{"$f":"IF(W27=0,\"\",IF(W19=W27,$V$19,IF(W20=W27,$V$20,IF(W21=W27,$V$21,IF(W22=W27,$V$22,IF(W23=W27,$V$23,IF(W24=W27,$V$24,IF(W25=W27,$V$25,IF(W26=W27,$V$26,\"\")))))))))","v":""},"","","","","","","","","","","","","","",null,null,null,null,null,null,null,null,null,null,null,null,null,null,null,null,null,null,24]
[null,null,null,null,null,null,null,null,null,null,null,null,null,null,null,null,{"$f":"IF(R31=\"\",\"\",VLOOKUP(R31,Planning_général!$E$17:$F$62,2,0))","v":""},{"$f":"IF(W31=1,$W$3,IF(X31=1,$X$3,IF(Y31=1,$Y$3,IF(Z31=1,Z3,IF(AA31=1,$AA$3,IF(AB31=1,$AB$3,IF(AC31=1,$AC$3,IF(AD31=1,$AD$3,IF(AE31=1,$AE$3,IF(AF31=1,$AF$3,IF(AG31=1,$AG$3,IF(AH31=1,AH3,IF(AI31=1,$AI$3,IF(AJ31=1,$AJ$3,IF(AK31=1,$AK$3,\"\")))))))))))))))","v":""},{"$f":"IF(U31=1,U$9,IF(V31=1,V$9,IF(W31=1,W$9,IF(X31=1,X$9,IF(Y31=1,Y$9,IF(Z31=1,Z$9,IF(AA31=1,AA$9,IF(AB31=1,AB$9,IF(AC31=1,AC$9,IF(AD31=1,AD$9,IF(AE31=1,AE$9,\"\")))))))))))","v":""},"Jrnée",null,"J1",{"$f":"IF($V$31=W30,1,\"\")","v":""},{"$f":"IF(AND($V$31=$X$30,W31=\"\"),1,\"\")","v":""},{"$f":"IF(AND($V$31=$Y$30,X31=\"\",W31=\"\"),1,\"\")","v":""},{"$f":"IF(AND($V$31=Z30,W31=\"\",X31=\"\",Y31=\"\"),1,\"\")","v":""},{"$f":"IF(AND($V$31=AA30,X31=\"\",Y31=\"\",Z31=\"\",W31=\"\"),1,\"\")","v":""},{"$f":"IF(AND($V$31=AB30,Y31=\"\",Z31=\"\",AA31=\"\",X31=\"\",W31=\"\"),1,\"\")","v":""},{"$f":"IF(AND($V$31=AC30,Z31=\"\",AA31=\"\",AB31=\"\",Y31=\"\",X31=\"\",W31=\"\"),1,\"\")","v":""},{"$f":"IF(AND($V$31=AD30,AA31=\"\",AB31=\"\",AC31=\"\",Z31=\"\",Y31=\"\",X31=\"\",W31=\"\"),1,\"\")","v":""},{"$f":"IF(AND($V$31=AE30,AB31=\"\",AC31=\"\",AD31=\"\",AA31=\"\",Z31=\"\",Y31=\"\",X31=\"\",W31=\"\"),1,\"\")","v":""},{"$f":"IF(AND($V$31=AF30,AC31=\"\",AD31=\"\",AE31=\"\",AB31=\"\",AA31=\"\",Z31=\"\",Y31=\"\",X31=\"\",W31=\"\"),1,\"\")","v":""},{"$f":"IF(AND($V$31=AG30,AD31=\"\",AE31=\"\",AF31=\"\",AC31=\"\",AB31=\"\",AA31=\"\",Z31=\"\",Y31=\"\",X31=\"\",W31=\"\"),1,\"\")","v":""},{"$f":"IF(AND($V$31=AH30,AE31=\"\",AF31=\"\",AG31=\"\",AD31=\"\",AC31=\"\",AB31=\"\",AA31=\"\",Z31=\"\",Y31=\"\",X31=\"\",W31=\"\"),1,\"\")","v":""},{"$f":"IF(AND($V$31=AI30,AF31=\"\",AG31=\"\",AH31=\"\",AE31=\"\",AD31=\"\",AC31=\"\",AB31=\"\",AA31=\"\",Z31=\"\",Y31=\"\",X31=\"\",W31=\"\"),1,\"\")","v":""},{"$f":"IF(AND($V$31=AJ30,AG31=\"\",AH31=\"\",AI31=\"\",AF31=\"\",AE31=\"\",AD31=\"\",AC31=\"\",AB31=\"\",AA31=\"\",Z31=\"\",Y31=\"\",X31=\"\",W31=\"\"),1,\"\")","v":""},{"$f":"IF(AND($V$31=AK30,AH31=\"\",AI31=\"\",AJ31=\"\",AG31=\"\",AF31=\"\",AE31=\"\",AD31=\"\",AC31=\"\",AB31=\"\",AA31=\"\",Z31=\"\",Y31=\"\",X31=\"\",W31=\"\"),1,\"\")","v":""},null,null,null,null,null,null,null,null,null,null,null,null,null,null,null,null,null,null,25]
[null,null,null,null,null,null,null,null,null,null,null,null,null,null,null,null,{"$f":"IF(R32=\"\",\"\",VLOOKUP(R32,Planning_général!$E$17:$F$62,2,0))","v":""},{"$f":"IF(W32=1,$W$3,IF(X32=1,$X$3,IF(Y32=1,$Y$3,IF(Z32=1,Z3,IF(AA32=1,$AA$3,IF(AB32=1,$AB$3,IF(AC32=1,$AC$3,IF(AD32=1,$AD$3,IF(AE32=1,$AE$3,IF(AF32=1,$AF$3,IF(AG32=1,$AG$3,IF(AH32=1,AH3,IF(AI32=1,$AI$3,IF(AJ32=1,$AJ$3,IF(AK32=1,$AK$3,\"\")))))))))))))))","v":""},{"$f":"IF(U32=1,U$9,IF(V32=1,V$9,IF(W32=1,W$9,IF(X32=1,X$9,IF(Y32=1,Y$9,IF(Z32=1,Z$9,IF(AA32=1,AA$9,IF(AB32=1,AB$9,IF(AC32=1,AC$9,IF(AD32=1,AD$9,IF(AE32=1,AE$9,\"\")))))))))))","v":""},null,null,"J1",null,{"$f":"IF(AND(X$30=$V$32,W32=\"\",X31=\"\"),1,\"\")","v":""},{"$f":"IF(AND(Y$30=$V$32,X32=\"\",Y31=\"\"),1,\"\")","v":""},"",{"$f":"IF(AND(AA$30=$V$32,AA31=\"\",SUM($X$32:Z32)=0),1,\"\")","v":""},{"$f":"IF(AND(AB$30=$V$32,AB31=\"\",SUM($X$32:AA32)=0),1,\"\")","v":""},{"$f":"IF(AND(AC$30=$V$32,AC31=\"\",SUM($X$32:AB32)=0),1,\"\")","v":""},{"$f":"IF(AND(AD$30=$V$32,AD31=\"\",SUM($X$32:AC32)=0),1,\"\")","v":""},{"$f":"IF(AND(AE$30=$V$32,AE31=\"\",SUM($X$32:AD32)=0),1,\"\")","v":""},{"$f":"IF(AND(AF$30=$V$32,AF31=\"\",SUM($X$32:AE32)=0),1,\"\")","v":""},{"$f":"IF(AND(AG$30=$V$32,AG31=\"\",SUM($X$32:AF32)=0),1,\"\")","v":""},{"$f":"IF(AND(AH$30=$V$32,AH31=\"\",SUM($X$32:AG32)=0),1,\"\")","v":""},{"$f":"IF(AND(AI$30=$V$32,AI31=\"\",SUM($X$32:AH32)=0),1,\"\")","v":""},{"$f":"IF(AND(AJ$30=$V$32,AJ31=\"\",SUM($X$32:AI32)=0),1,\"\")","v":""},{"$f":"IF(AND(AK$30=$V$32,AK31=\"\",SUM($X$32:AJ32)=0),1,\"\")","v":""},null,null,null,null,null,null,null,null,null,null,null,null,null,null,null,null,null,null,26]
[null,null,null,null,null,null,null,null,null,null,null,null,null,null,null,null,{"$f":"IF(R33=\"\",\"\",VLOOKUP(R33,Planning_général!$E$17:$F$62,2,0))","v":""},{"$f":"IF(W33=1,$W$3,IF(X33=1,$X$3,IF(Y33=1,$Y$3,IF(Z33=1,Z3,IF(AA33=1,$AA$3,IF(AB33=1,$AB$3,IF(AC33=1,$AC$3,IF(AD33=1,$AD$3,IF(AE33=1,$AE$3,IF(AF33=1,$AF$3,IF(AG33=1,$AG$3,IF(AH33=1,AH3,IF(AI33=1,$AI$3,IF(AJ33=1,$AJ$3,IF(AK33=1,$AK$3,\"\")))))))))))))))","v":""},{"$f":"IF(U33=1,U$9,IF(V33=1,V$9,IF(W33=1,W$9,IF(X33=1,X$9,IF(Y33=1,Y$9,IF(Z33=1,Z$9,IF(AA33=1,AA$9,IF(AB33=1,AB$9,IF(AC33=1,AC$9,IF(AD33=1,AD$9,IF(AE33=1,AE$9,\"\")))))))))))","v":""},null,null,"-",null,null,{"$f":"IF(AND(Y$30=V33,X33=\"\",Y32=\"\",Y31=\"\"),1,\"\")","v":""},{"$f":"IF(AND(Z$30=V33,Y33=\"\",Z32=\"\",Z31=\"\"),1,\"\")","v":""},{"$f":"IF(AND(AA$30=$V$33,AA31=\"\",AA32=\"\",SUM($Y$33:Z33)=0),1,\"\")","v":""},{"$f":"IF(AND(AB$30=$V$33,AB31=\"\",AB32=\"\",SUM($Y$33:AA33)=0),1,\"\")","v":""},{"$f":"IF(AND(AC$30=$V$33,AC31=\"\",AC32=\"\",SUM($Y$33:AB33)=0),1,\"\")","v":""},{"$f":"IF(AND(AD$30=$V$33,AD31=\"\",AD32=\"\",SUM($Y$33:AC33)=0),1,\"\")","v":""},{"$f":"IF(AND(AE$30=$V$33,AE31=\"\",AE32=\"\",SUM($Y$33:AD33)=0),1,\"\")","v":""},{"$f":"IF(AND(AF$30=$V$33,AF31=\"\",AF32=\"\",SUM($Y$33:AE33)=0),1,\"\")","v":""},{"$f":"IF(AND(AG$30=$V$33,AG31=\"\",AG32=\"\",SUM($Y$33:AF33)=0),1,\"\")","v":""},{"$f":"IF(AND(AH$30=$V$33,AH31=\"\",AH32=\"\",SUM($Y$33:AG33)=0),1,\"\")","v":""},{"$f":"IF(AND(AI$30=$V$33,AI31=\"\",AI32=\"\",SUM($Y$33:AH33)=0),1,\"\")","v":""},{"$f":"IF(AND(AJ$30=$V$33,AJ31=\"\",AJ32=\"\",SUM($Y$33:AI33)=0),1,\"\")","v":""},{"$f":"IF(AND(AK$30=$V$33,AK31=\"\",AK32=\"\",SUM($Y$33:AJ33)=0),1,\"\")","v":""},null,null,null,null,null,null,null,null,null,null,null,null,null,null,null,null,null,null,27]
[null,null,null,null,null,null,null,null,null,null,null,null,null,null,null,null,null,null,null,null,null,null,null,null,null,null,null,null,null,null,null,null,null,null,null,null,null,null,null,null,null,null,null,null,null,null,null,null,null,null,null,null,null,null,null,28]
[null,null,null,null,null,null,null,null,null,null,null,null,null,null,null,null,{"$f":"IF(R35=\"\",\"\",VLOOKUP(R35,Planning_général!$E$17:$F$62,2,0))","v":""},{"$f":"IF(W35=1,$W$3,IF(X35=1,$X$3,IF(Y35=1,$Y$3,IF(Z35=1,Z3,IF(AA35=1,$AA$3,IF(AB35=1,$AB$3,IF(AC35=1,$AC$3,IF(AD35=1,$AD$3,IF(AE35=1,$AE$3,IF(AF35=1,$AF$3,IF(AG35=1,$AG$3,IF(AH35=1,AH7,IF(AI35=1,$AI$3,IF(AJ35=1,$AJ$3,IF(AK35=1,$AK$3,\"\")))))))))))))))","v":""},{"$f":"IF(U35=1,U$9,IF(V35=1,V$9,IF(W35=1,W$9,IF(X35=1,X$9,IF(Y35=1,Y$9,IF(Z35=1,Z$9,IF(AA35=1,AA$9,IF(AB35=1,AB$9,IF(AC35=1,AC$9,IF(AD35=1,AD$9,IF(AE35=1,AE$9,\"\")))))))))))","v":""},"Début",null,"J2",{"$f":"IF($V$35=W30,1,\"\")","v":""},{"$f":"IF(AND($V$35=$X$30,W35=\"\"),1,\"\")","v":""},{"$f":"IF(AND($V$35=$Y$30,X35=\"\",W35=\"\"),1,\"\")","v":""},{"$f":"IF(AND($V$35=Z30,W35=\"\",X35=\"\",Y35=\"\"),1,\"\")","v":""},{"$f":"IF(AND($V$35=AA30,X35=\"\",Y35=\"\",Z35=\"\",W35=\"\"),1,\"\")","v":""},{"$f":"IF(AND($V$35=AB30,Y35=\"\",Z35=\"\",AA35=\"\",X35=\"\",W35=\"\"),1,\"\")","v":""},{"$f":"IF(AND($V$35=AC30,Z35=\"\",AA35=\"\",AB35=\"\",Y35=\"\",X35=\"\",W35=\"\"),1,\"\")","v":""},{"$f":"IF(AND($V$35=AD30,AA35=\"\",AB35=\"\",AC35=\"\",Z35=\"\",Y35=\"\",X35=\"\",W35=\"\"),1,\"\")","v":""},{"$f":"IF(AND($V$35=AE30,AB35=\"\",AC35=\"\",AD35=\"\",AA35=\"\",Z35=\"\",Y35=\"\",X35=\"\",W35=\"\"),1,\"\")","v":""},{"$f":"IF(AND($V$35=AF30,AC35=\"\",AD35=\"\",AE35=\"\",AB35=\"\",AA35=\"\",Z35=\"\",Y35=\"\",X35=\"\",W35=\"\"),1,\"\")","v":""},{"$f":"IF(AND($V$35=AG34,AD35=\"\",AE35=\"\",AF35=\"\",AC35=\"\",AB35=\"\",AA35=\"\",Z35=\"\",Y35=\"\",X35=\"\",W35=\"\"),1,\"\")","v":""},{"$f":"IF(AND($V$35=AH34,AE35=\"\",AF35=\"\",AG35=\"\",AD35=\"\",AC35=\"\",AB35=\"\",AA35=\"\",Z35=\"\",Y35=\"\",X35=\"\",W35=\"\"),1,\"\")","v":""},{"$f":"IF(AND($V$35=AI30,AF35=\"\",AG35=\"\",AH35=\"\",AE35=\"\",AD35=\"\",AC35=\"\",AB35=\"\",AA35=\"\",Z35=\"\",Y35=\"\",X35=\"\",W35=\"\"),1,\"\")","v":""},{"$f":"IF(AND($V$35=AJ34,AG35=\"\",AH35=\"\",AI35=\"\",AF35=\"\",AE35=\"\",AD35=\"\",AC35=\"\",AB35=\"\",AA35=\"\",Z35=\"\",Y35=\"\",X35=\"\",W35=\"\"),1,\"\")","v":""},{"$f":"IF(AND($V$35=AK34,AH35=\"\",AI35=\"\",AJ35=\"\",AG35=\"\",AF35=\"\",AE35=\"\",AD35=\"\",AC35=\"\",AB35=\"\",AA35=\"\",Z35=\"\",Y35=\"\",X35=\"\",W35=\"\"),1,\"\")","v":""},null,null,null,null,null,null,null,null,null,null,null,null,null,null,null,null,null,null,29]
[null,null,null,null,null,null,null,null,null,null,null,null,null,null,null,null,{"$f":"IF(R36=\"\",\"\",VLOOKUP(R36,Planning_général!$E$17:$F$62,2,0))","v":""},{"$f":"IF(W36=1,$W$3,IF(X36=1,$X$3,IF(Y36=1,$Y$3,IF(Z36=1,Z3,IF(AA36=1,$AA$3,IF(AB36=1,$AB$3,IF(AC36=1,$AC$3,IF(AD36=1,$AD$3,IF(AE36=1,$AE$3,IF(AF36=1,$AF$3,IF(AG36=1,$AG$3,IF(AH36=1,AH3,IF(AI36=1,$AI$3,IF(AJ36=1,$AJ$3,IF(AK36=1,$AK$3,\"\")))))))))))))))","v":""},{"$f":"IF(U36=1,U$9,IF(V36=1,V$9,IF(W36=1,W$9,IF(X36=1,X$9,IF(Y36=1,Y$9,IF(Z36=1,Z$9,IF(AA36=1,AA$9,IF(AB36=1,AB$9,IF(AC36=1,AC$9,IF(AD36=1,AD$9,IF(AE36=1,AE$9,\"\")))))))))))","v":""},null,null,"J2",null,{"$f":"IF(AND(X$30=$V$36,W36=\"\",X35=\"\"),1,\"\")","v":""},{"$f":"IF(AND(Y$30=$V$36,X36=\"\",Y35=\"\"),1,\"\")","v":""},{"$f":"IF(AND(Z$30=$V$36,Y36=\"\",Z35=\"\"),1,\"\")","v":""},{"$f":"IF(AND(AA$30=$V$36,AA35=\"\",SUM($X$36:Z36)=0),1,\"\")","v":""},{"$f":"IF(AND(AB$30=$V$36,AB35=\"\",SUM($X$36:AA36)=0),1,\"\")","v":""},{"$f":"IF(AND(AC$30=$V$36,AC35=\"\",SUM($X$36:AB36)=0),1,\"\")","v":""},{"$f":"IF(AND(AD$30=$V$36,AD35=\"\",SUM($X$36:AC36)=0),1,\"\")","v":""},{"$f":"IF(AND(AE$30=$V$36,AE35=\"\",SUM($X$36:AD36)=0),1,\"\")","v":""},{"$f":"IF(AND(AF$30=$V$36,AF35=\"\",SUM($X$36:AE36)=0),1,\"\")","v":""},{"$f":"IF(AND(AG$30=$V$36,AG35=\"\",SUM($X$36:AF36)=0),1,\"\")","v":""},{"$f":"IF(AND(AH$30=$V$36,AH35=\"\",SUM($X$36:AG36)=0),1,\"\")","v":""},{"$f":"IF(AND(AI$30=$V$36,AI35=\"\",SUM($X$36:AH36)=0),1,\"\")","v":""},{"$f":"IF(AND(AJ$30=$V$36,AJ35=\"\",SUM($X$36:AI36)=0),1,\"\")","v":""},{"$f":"IF(AND(AK$30=$V$36,AK35=\"\",SUM($X$36:AJ36)=0),1,\"\")","v":""},null,null,null,null,null,null,null,null,null,null,null,null,null,null,null,null,null,null,30]
[null,null,null,null,null,null,null,null,null,null,null,null,null,null,null,null,{"$f":"IF(R37=\"\",\"\",VLOOKUP(R37,Planning_général!$E$17:$F$62,2,0))","v":""},{"$f":"IF(W37=1,$W$3,IF(X37=1,$X$3,IF(Y37=1,$Y$3,IF(Z37=1,$Z$3,IF(AA37=1,$AA$3,IF(AB37=1,$AB$3,IF(AC37=1,$AC$3,IF(AD37=1,$AD$3,IF(AE37=1,$AE$3,IF(AF37=1,$AF$3,IF(AG37=1,$AG$3,IF(AH37=1,$AH$3,IF(AI37=1,$AI$3,IF(AJ37=1,$AJ$3,IF(AK37=1,$AK$3,\"\")))))))))))))))","v":""},{"$f":"IF(U37=1,U$9,IF(V37=1,V$9,IF(W37=1,W$9,IF(X37=1,X$9,IF(Y37=1,Y$9,IF(Z37=1,Z$9,IF(AA37=1,AA$9,IF(AB37=1,AB$9,IF(AC37=1,AC$9,IF(AD37=1,AD$9,IF(AE37=1,AE$9,\"\")))))))))))","v":""},null,null,"-",null,null,{"$f":"IF(AND(Y$30=V37,X37=\"\",Y36=\"\",Y35=\"\"),1,\"\")","v":""},{"$f":"IF(AND(Z$30=V37,Y37=\"\",Z36=\"\",Z35=\"\"),1,\"\")","v":""},{"$f":"IF(AND(AA$30=$V$37,AA35=\"\",AA36=\"\",SUM($Y$37:Z37)=0),1,\"\")","v":""},{"$f":"IF(AND(AB$30=$V$37,AB35=\"\",AB36=\"\",SUM($Y$37:AA37)=0),1,\"\")","v":""},{"$f":"IF(AND(AC$30=$V$37,AC35=\"\",AC36=\"\",SUM($Y$37:AB37)=0),1,\"\")","v":""},{"$f":"IF(AND(AD$30=$V$37,AD35=\"\",AD36=\"\",SUM($Y$37:AC37)=0),1,\"\")","v":""},{"$f":"IF(AND(AE$30=$V$37,AE35=\"\",AE36=\"\",SUM($Y$37:AD37)=0),1,\"\")","v":""},{"$f":"IF(AND(AF$30=$V$37,AF35=\"\",AF36=\"\",SUM($Y$37:AE37)=0),1,\"\")","v":""},{"$f":"IF(AND(AG$30=$V$37,AG35=\"\",AG36=\"\",SUM($Y$37:AF37)=0),1,\"\")","v":""},{"$f":"IF(AND(AH$30=$V$37,AH35=\"\",AH36=\"\",SUM($Y$37:AG37)=0),1,\"\")","v":""},{"$f":"IF(AND(AI$30=$V$37,AI35=\"\",AI36=\"\",SUM($Y$37:AH37)=0),1,\"\")","v":""},{"$f":"IF(AND(AJ$30=$V$37,AJ35=\"\",AJ36=\"\",SUM($Y$37:AI37)=0),1,\"\")","v":""},{"$f":"IF(AND(AK$30=$V$37,AK35=\"\",AK36=\"\",SUM($Y$37:AJ37)=0),1,\"\")","v":""},null,null,null,null,null,null,null,null,null,null,null,null,null,null,null,null,null,null,31]
[null,null,null,null,null,null,null,null,null,null,null,null,null,null,null,null,null,null,null,null,null,null,null,null,null,null,null,null,null,null,null,null,null,null,null,null,null,null,null,null,null,null,null,null,null,null,null,null,null,null,null,null,null,null,null,32]
[null,null,null,null,null,null,null,null,null,null,null,null,null,null,null,null,null,null,null,null,null,null,null,null,null,null,null,null,null,null,null,null,null,null,null,null,null,null,null,null,null,null,null,null,null,null,null,null,null,null,null,null,null,null,null,33]
[null,null,null,null,null,null,null,null,null,null,null,null,null,null,null,null,{"$f":"IF(R40=\"\",\"\",VLOOKUP(R40,Planning_général!$E$17:$F$62,2,0))","v":""},{"$f":"IF(W40=1,$W$3,IF(X40=1,$X$3,IF(Y40=1,$Y$3,IF(Z40=1,Z3,IF(AA40=1,$AA$3,IF(AB40=1,$AB$3,IF(AC40=1,$AC$3,IF(AD40=1,$AD$3,IF(AE40=1,$AE$3,IF(AF40=1,$AF$3,IF(AG40=1,$AG$3,IF(AH40=1,AH12,IF(AI40=1,$AI$3,IF(AJ40=1,$AJ$3,IF(AK40=1,$AK$3,\"\")))))))))))))))","v":""},{"$f":"IF(U40=1,U$9,IF(V40=1,V$9,IF(W40=1,W$9,IF(X40=1,X$9,IF(Y40=1,Y$9,IF(Z40=1,Z$9,IF(AA40=1,AA$9,IF(AB40=1,AB$9,IF(AC40=1,AC$9,IF(AD40=1,AD$9,IF(AE40=1,AE$9,\"\")))))))))))","v":""},"Début",null,"M1",{"$f":"IF($V$40=$W$30,1,\"\")","v":""},{"$f":"IF(AND($V$40=$X$30,W40=\"\"),1,\"\")","v":""},{"$f":"IF(AND($V$40=$Y$30,X40=\"\",W40=\"\"),1,\"\")","v":""},{"$f":"IF(AND($V$40=Z30,W40=\"\",X40=\"\",Y40=\"\"),1,\"\")","v":""},{"$f":"IF(AND($V$40=$AA$30,X40=\"\",Y40=\"\",Z40=\"\",W40=\"\"),1,\"\")","v":""},{"$f":"IF(AND($V$40=$AB$30,Y40=\"\",Z40=\"\",AA40=\"\",X40=\"\",W40=\"\"),1,\"\")","v":""},{"$f":"IF(AND($V$40=AC30,Z40=\"\",AA40=\"\",AB40=\"\",Y40=\"\",X40=\"\",W40=\"\"),1,\"\")","v":""},{"$f":"IF(AND($V$40=AD30,AA40=\"\",AB40=\"\",AC40=\"\",Z40=\"\",Y40=\"\",X40=\"\",W40=\"\"),1,\"\")","v":""},{"$f":"IF(AND($V$40=$AE$30,AB40=\"\",AC40=\"\",AD40=\"\",AA40=\"\",Z40=\"\",Y40=\"\",X40=\"\",W40=\"\"),1,\"\")","v":""},{"$f":"IF(AND($V$40=$AF$30,AC40=\"\",AD40=\"\",AE40=\"\",AB40=\"\",AA40=\"\",Z40=\"\",Y40=\"\",X40=\"\",W40=\"\"),1,\"\")","v":""},{"$f":"IF(AND($V$40=$AG$30,AD40=\"\",AE40=\"\",AF40=\"\",AC40=\"\",AB40=\"\",AA40=\"\",Z40=\"\",Y40=\"\",X40=\"\",W40=\"\"),1,\"\")","v":""},{"$f":"IF(AND($V$40=$AH$30,AE40=\"\",AF40=\"\",AG40=\"\",AD40=\"\",AC40=\"\",AB40=\"\",AA40=\"\",Z40=\"\",Y40=\"\",X40=\"\",W40=\"\"),1,\"\")","v":""},{"$f":"IF(AND($V$40=$AI$30,AF40=\"\",AG40=\"\",AH40=\"\",AE40=\"\",AD40=\"\",AC40=\"\",AB40=\"\",AA40=\"\",Z40=\"\",Y40=\"\",X40=\"\",W40=\"\"),1,\"\")","v":""},{"$f":"IF(AND($V$40=$AJ$30,AG40=\"\",AH40=\"\",AI40=\"\",AF40=\"\",AE40=\"\",AD40=\"\",AC40=\"\",AB40=\"\",AA40=\"\",Z40=\"\",Y40=\"\",X40=\"\",W40=\"\"),1,\"\")","v":""},{"$f":"IF(AND($V$40=$AK$30,AH40=\"\",AI40=\"\",AJ40=\"\",AG40=\"\",AF40=\"\",AE40=\"\",AD40=\"\",AC40=\"\",AB40=\"\",AA40=\"\",Z40=\"\",Y40=\"\",X40=\"\",W40=\"\"),1,\"\")","v":""},null,null,null,null,null,null,null,null,null,null,null,null,null,null,null,null,null,null,34]
[null,null,null,null,null,null,null,null,null,null,null,null,null,null,null,null,{"$f":"IF(R41=\"\",\"\",VLOOKUP(R41,Planning_général!$E$17:$F$62,2,0))","v":""},{"$f":"IF(W41=1,$W$3,IF(X41=1,$X$3,IF(Y41=1,$Y$3,IF(Z41=1,$Z$3,IF(AA41=1,$AA$3,IF(AB41=1,$AB$3,IF(AC41=1,$AC$3,IF(AD41=1,$AD$3,IF(AE41=1,$AE$3,IF(AF41=1,$AF$3,IF(AG41=1,$AG$3,IF(AH41=1,$AH$3,IF(AI41=1,$AI$3,IF(AJ41=1,$AJ$3,IF(AK41=1,$AK$3,\"\")))))))))))))))","v":""},{"$f":"IF(U41=1,U$9,IF(V41=1,V$9,IF(W41=1,W$9,IF(X41=1,X$9,IF(Y41=1,Y$9,IF(Z41=1,Z$9,IF(AA41=1,AA$9,IF(AB41=1,AB$9,IF(AC41=1,AC$9,IF(AD41=1,AD$9,IF(AE41=1,AE$9,\"\")))))))))))","v":""},null,null,"M1",null,{"$f":"IF(AND(X$30=$V$41,W41=\"\",X40=\"\"),1,\"\")","v":""},{"$f":"IF(AND(Y$30=$V$41,X41=\"\",Y40=\"\"),1,\"\")","v":""},{"$f":"IF(AND(Z$30=$V$41,Y41=\"\",Z40=\"\"),1,\"\")","v":""},{"$f":"IF(AND(AA$30=$V$41,AA40=\"\",SUM($X$41:Z41)=0),1,\"\")","v":""},{"$f":"IF(AND(AB$30=$V$41,AB40=\"\",SUM($X$41:AA41)=0),1,\"\")","v":""},{"$f":"IF(AND(AC$30=$V$41,AC40=\"\",SUM($X$41:AB41)=0),1,\"\")","v":""},{"$f":"IF(AND(AD$30=$V$41,AD40=\"\",SUM($X$41:AC41)=0),1,\"\")","v":""},{"$f":"IF(AND(AE$30=$V$41,AE40=\"\",SUM($X$41:AD41)=0),1,\"\")","v":""},{"$f":"IF(AND(AF$30=$V$41,AF40=\"\",SUM($X$41:AE41)=0),1,\"\")","v":""},{"$f":"IF(AND(AG$30=$V$41,AG40=\"\",SUM($X$41:AF41)=0),1,\"\")","v":""},{"$f":"IF(AND(AH$30=$V$41,AH40=\"\",SUM($X$41:AG41)=0),1,\"\")","v":""},{"$f":"IF(AND(AI$30=$V$41,AI40=\"\",SUM($X$41:AH41)=0),1,\"\")","v":""},{"$f":"IF(AND(AJ$30=$V$41,AJ40=\"\",SUM($X$41:AI41)=0),1,\"\")","v":""},{"$f":"IF(AND(AK$30=$V$41,AK40=\"\",SUM($X$41:AJ41)=0),1,\"\")","v":""},null,null,null,null,null,null,null,null,null,null,null,null,null,null,null,null,null,null,35]
[null,null,null,null,null,null,null,null,null,null,null,null,null,null,null,null,{"$f":"IF(R42=\"\",\"\",VLOOKUP(R42,Planning_général!$E$17:$F$62,2,0))","v":""},{"$f":"IF(W42=1,$W$3,IF(X42=1,$X$3,IF(Y42=1,$Y$3,IF(Z42=1,Z10,IF(AA42=1,$AA$3,IF(AB42=1,$AB$3,IF(AC42=1,$AC$3,IF(AD42=1,$AD$3,IF(AE42=1,$AE$3,IF(AF42=1,$AF$3,IF(AG42=1,$AG$3,IF(AH42=1,$AH$3,IF(AI42=1,$AI$3,IF(AJ42=1,$AJ$3,IF(AK42=1,$AK$3,\"\")))))))))))))))","v":""},{"$f":"IF(U42=1,U$9,IF(V42=1,V$9,IF(W42=1,W$9,IF(X42=1,X$9,IF(Y42=1,Y$9,IF(Z42=1,Z$9,IF(AA42=1,AA$9,IF(AB42=1,AB$9,IF(AC42=1,AC$9,IF(AD42=1,AD$9,IF(AE42=1,AE$9,\"\")))))))))))","v":""},null,null,"-",null,null,{"$f":"IF(AND(Y$30=V42,X42=\"\",Y41=\"\",Y40=\"\"),1,\"\")","v":""},{"$f":"IF(AND(Z$30=V42,Y42=\"\",Z41=\"\",Z40=\"\"),1,\"\")","v":""},{"$f":"IF(AND(AA$30=$V$42,AA40=\"\",AA41=\"\",SUM($Y$42:Z42)=0),1,\"\")","v":""},{"$f":"IF(AND(AB$30=$V$42,AB40=\"\",AB41=\"\",SUM($Y$42:AA42)=0),1,\"\")","v":""},{"$f":"IF(AND(AC$30=$V$42,AC40=\"\",AC41=\"\",SUM($Y$42:AB42)=0),1,\"\")","v":""},{"$f":"IF(AND(AD$30=$V$42,AD40=\"\",AD41=\"\",SUM($Y$42:AC42)=0),1,\"\")","v":""},{"$f":"IF(AND(AE$30=$V$42,AE40=\"\",AE41=\"\",SUM($Y$42:AD42)=0),1,\"\")","v":""},{"$f":"IF(AND(AF$30=$V$42,AF40=\"\",AF41=\"\",SUM($Y$42:AE42)=0),1,\"\")","v":""},{"$f":"IF(AND(AG$30=$V$42,AG40=\"\",AG41=\"\",SUM($Y$42:AF42)=0),1,\"\")","v":""},{"$f":"IF(AND(AH$30=$V$42,AH40=\"\",AH41=\"\",SUM($Y$42:AG42)=0),1,\"\")","v":""},{"$f":"IF(AND(AI$30=$V$42,AI40=\"\",AI41=\"\",SUM($Y$42:AH42)=0),1,\"\")","v":""},{"$f":"IF(AND(AJ$30=$V$42,AJ40=\"\",AJ41=\"\",SUM($Y$42:AI42)=0),1,\"\")","v":""},{"$f":"IF(AND(AK$30=$V$42,AK40=\"\",AK41=\"\",SUM($Y$42:AJ42)=0),1,\"\")","v":""},null,null,null,null,null,null,null,null,null,null,null,null,null,null,null,null,null,null,36]
[null,null,null,null,null,null,null,null,null,null,null,null,null,null,null,null,null,null,null,null,null,null,null,null,null,null,null,null,null,null,null,null,null,null,null,null,null,null,null,null,null,null,null,null,null,null,null,null,null,null,null,null,null,null,null,37]
[null,null,null,null,null,null,null,null,null,null,null,null,null,null,null,null,null,null,null,null,null,null,null,null,null,null,null,null,null,null,null,null,null,null,null,null,null,null,null,null,null,null,null,null,null,null,null,null,null,null,null,null,null,null,null,38]
[null,null,null,null,null,null,null,null,null,null,null,null,null,null,null,null,{"$f":"IF(R45=\"\",\"\",VLOOKUP(R45,Planning_général!$E$17:$F$62,2,0))","v":""},{"$f":"IF(W45=1,$W$3,IF(X45=1,$X$3,IF(Y45=1,$Y$3,IF(Z45=1,Z3,IF(AA45=1,$AA$3,IF(AB45=1,$AB$3,IF(AC45=1,$AC$3,IF(AD45=1,$AD$3,IF(AE45=1,$AE$3,IF(AF45=1,$AF$3,IF(AG45=1,$AG$3,IF(AH45=1,AH3,IF(AI45=1,$AI$3,IF(AJ45=1,$AJ$3,IF(AK45=1,$AK$3,\"\")))))))))))))))","v":""},{"$f":"IF(U45=1,U$9,IF(V45=1,V$9,IF(W45=1,W$9,IF(X45=1,X$9,IF(Y45=1,Y$9,IF(Z45=1,Z$9,IF(AA45=1,AA$9,IF(AB45=1,AB$9,IF(AC45=1,AC$9,IF(AD45=1,AD$9,IF(AE45=1,AE$9,\"\")))))))))))","v":""},"Matin",null,"M2",{"$f":"IF($V$45=$W$30,1,\"\")","v":""},{"$f":"IF(AND($V$45=$X$30,W45=\"\"),1,\"\")","v":""},{"$f":"IF(AND($V$45=$Y$30,X45=\"\",W45=\"\"),1,\"\")","v":""},{"$f":"IF(AND($V$45=Z35,W45=\"\",X45=\"\",Y45=\"\"),1,\"\")","v":""},{"$f":"IF(AND($V$45=$AA$30,X45=\"\",Y45=\"\",Z45=\"\",W45=\"\"),1,\"\")","v":""},{"$f":"IF(AND($V$45=$AB$30,Y45=\"\",Z45=\"\",AA45=\"\",X45=\"\",W45=\"\"),1,\"\")","v":""},{"$f":"IF(AND($V$45=AC35,Z45=\"\",AA45=\"\",AB45=\"\",Y45=\"\",X45=\"\",W45=\"\"),1,\"\")","v":""},{"$f":"IF(AND($V$45=AD35,AA45=\"\",AB45=\"\",AC45=\"\",Z45=\"\",Y45=\"\",X45=\"\",W45=\"\"),1,\"\")","v":""},{"$f":"IF(AND($V$45=$AE$30,AB45=\"\",AC45=\"\",AD45=\"\",AA45=\"\",Z45=\"\",Y45=\"\",X45=\"\",W45=\"\"),1,\"\")","v":""},{"$f":"IF(AND($V$45=$AF$30,AC45=\"\",AD45=\"\",AE45=\"\",AB45=\"\",AA45=\"\",Z45=\"\",Y45=\"\",X45=\"\",W45=\"\"),1,\"\")","v":""},{"$f":"IF(AND($V$45=$AG$30,AD45=\"\",AE45=\"\",AF45=\"\",AC45=\"\",AB45=\"\",AA45=\"\",Z45=\"\",Y45=\"\",X45=\"\",W45=\"\"),1,\"\")","v":""},{"$f":"IF(AND($V$45=$AH$30,AE45=\"\",AF45=\"\",AG45=\"\",AD45=\"\",AC45=\"\",AB45=\"\",AA45=\"\",Z45=\"\",Y45=\"\",X45=\"\",W45=\"\"),1,\"\")","v":""},{"$f":"IF(AND($V$45=$AI$30,AF45=\"\",AG45=\"\",AH45=\"\",AE45=\"\",AD45=\"\",AC45=\"\",AB45=\"\",AA45=\"\",Z45=\"\",Y45=\"\",X45=\"\",W45=\"\"),1,\"\")","v":""},{"$f":"IF(AND($V$45=$AJ$30,AG45=\"\",AH45=\"\",AI45=\"\",AF45=\"\",AE45=\"\",AD45=\"\",AC45=\"\",AB45=\"\",AA45=\"\",Z45=\"\",Y45=\"\",X45=\"\",W45=\"\"),1,\"\")","v":""},{"$f":"IF(AND($V$45=$AK$30,AH45=\"\",AI45=\"\",AJ45=\"\",AG45=\"\",AF45=\"\",AE45=\"\",AD45=\"\",AC45=\"\",AB45=\"\",AA45=\"\",Z45=\"\",Y45=\"\",X45=\"\",W45=\"\"),1,\"\")","v":""},null,null,null,null,null,null,null,null,null,null,null,null,null,null,null,null,null,null,39]
[null,null,null,null,null,null,null,null,null,null,null,null,null,null,null,null,{"$f":"IF(R46=\"\",\"\",VLOOKUP(R46,Planning_général!$E$17:$F$62,2,0))","v":""},{"$f":"IF(W46=1,$W$3,IF(X46=1,$X$3,IF(Y46=1,$Y$3,IF(Z46=1,$Z$3,IF(AA46=1,$AA$3,IF(AB46=1,$AB$3,IF(AC46=1,$AC$3,IF(AD46=1,$AD$3,IF(AE46=1,$AE$3,IF(AF46=1,$AF$3,IF(AG46=1,$AG$3,IF(AH46=1,$AH$3,IF(AI46=1,$AI$3,IF(AJ46=1,$AJ$3,IF(AK46=1,$AK$3,\"\")))))))))))))))","v":""},{"$f":"IF(U46=1,U$9,IF(V46=1,V$9,IF(W46=1,W$9,IF(X46=1,X$9,IF(Y46=1,Y$9,IF(Z46=1,Z$9,IF(AA46=1,AA$9,IF(AB46=1,AB$9,IF(AC46=1,AC$9,IF(AD46=1,AD$9,IF(AE46=1,AE$9,\"\")))))))))))","v":""},null,null,"M2",null,{"$f":"IF(AND(X$30=$V$46,W46=\"\",X45=\"\"),1,\"\")","v":""},{"$f":"IF(AND(Y$30=$V$46,X46=\"\",Y45=\"\"),1,\"\")","v":""},{"$f":"IF(AND(Z$30=$V$46,Y46=\"\",Z45=\"\"),1,\"\")","v":""},{"$f":"IF(AND(AA$30=$V$46,AA45=\"\",SUM($X$46:Z46)=0),1,\"\")","v":""},{"$f":"IF(AND(AB$30=$V$46,AB45=\"\",SUM($X$46:AA46)=0),1,\"\")","v":""},{"$f":"IF(AND(AC$30=$V$46,AC45=\"\",SUM($X$46:AB46)=0),1,\"\")","v":""},{"$f":"IF(AND(AD$30=$V$46,AD45=\"\",SUM($X$46:AC46)=0),1,\"\")","v":""},{"$f":"IF(AND(AE$30=$V$46,AE45=\"\",SUM($X$46:AD46)=0),1,\"\")","v":""},{"$f":"IF(AND(AF$30=$V$46,AF45=\"\",SUM($X$46:AE46)=0),1,\"\")","v":""},{"$f":"IF(AND(AG$30=$V$46,AG45=\"\",SUM($X$46:AF46)=0),1,\"\")","v":""},{"$f":"IF(AND(AH$30=$V$46,AH45=\"\",SUM($X$46:AG46)=0),1,\"\")","v":""},{"$f":"IF(AND(AI$30=$V$46,AI45=\"\",SUM($X$46:AH46)=0),1,\"\")","v":""},{"$f":"IF(AND(AJ$30=$V$46,AJ45=\"\",SUM($X$46:AI46)=0),1,\"\")","v":""},{"$f":"IF(AND(AK$30=$V$46,AK45=\"\",SUM($X$46:AJ46)=0),1,\"\")","v":""},null,null,null,null,null,null,null,null,null,null,null,null,null,null,null,null,null,null,40]
[null,null,null,null,null,null,null,null,null,null,null,null,null,null,null,null,{"$f":"IF(R47=\"\",\"\",VLOOKUP(R47,Planning_général!$E$17:$F$62,2,0))","v":""},{"$f":"IF(W47=1,$W$3,IF(X47=1,$X$3,IF(Y47=1,$Y$3,IF(Z47=1,$Z$3,IF(AA47=1,$AA$3,IF(AB47=1,$AB$3,IF(AC47=1,$AC$3,IF(AD47=1,$AD$3,IF(AE47=1,$AE$3,IF(AF47=1,$AF$3,IF(AG47=1,$AG$3,IF(AH47=1,$AH$3,IF(AI47=1,$AI$3,IF(AJ47=1,$AJ$3,IF(AK47=1,$AK$3,\"\")))))))))))))))","v":""},{"$f":"IF(U47=1,U$9,IF(V47=1,V$9,IF(W47=1,W$9,IF(X47=1,X$9,IF(Y47=1,Y$9,IF(Z47=1,Z$9,IF(AA47=1,AA$9,IF(AB47=1,AB$9,IF(AC47=1,AC$9,IF(AD47=1,AD$9,IF(AE47=1,AE$9,\"\")))))))))))","v":""},null,null,"-",null,null,{"$f":"IF(AND(Y$30=V47,X47=\"\",Y46=\"\",Y45=\"\"),1,\"\")","v":""},{"$f":"IF(AND(Z$30=V47,Y47=\"\",Z46=\"\",Z45=\"\"),1,\"\")","v":""},{"$f":"IF(AND(AA$30=$V$47,AA45=\"\",AA46=\"\",SUM($Y$47:Z47)=0),1,\"\")","v":""},{"$f":"IF(AND(AB$30=$V$47,AB45=\"\",AB46=\"\",SUM($Y$47:AA47)=0),1,\"\")","v":""},{"$f":"IF(AND(AC$30=$V$47,AC45=\"\",AC46=\"\",SUM($Y$47:AB47)=0),1,\"\")","v":""},{"$f":"IF(AND(AD$30=$V$47,AD45=\"\",AD46=\"\",SUM($Y$47:AC47)=0),1,\"\")","v":""},{"$f":"IF(AND(AE$30=$V$47,AE45=\"\",AE46=\"\",SUM($Y$47:AD47)=0),1,\"\")","v":""},{"$f":"IF(AND(AF$30=$V$47,AF45=\"\",AF46=\"\",SUM($Y$47:AE47)=0),1,\"\")","v":""},{"$f":"IF(AND(AG$30=$V$47,AG45=\"\",AG46=\"\",SUM($Y$47:AF47)=0),1,\"\")","v":""},{"$f":"IF(AND(AH$30=$V$47,AH45=\"\",AH46=\"\",SUM($Y$47:AG47)=0),1,\"\")","v":""},{"$f":"IF(AND(AI$30=$V$47,AI45=\"\",AI46=\"\",SUM($Y$47:AH47)=0),1,\"\")","v":""},{"$f":"IF(AND(AJ$30=$V$47,AJ45=\"\",AJ46=\"\",SUM($Y$47:AI47)=0),1,\"\")","v":""},{"$f":"IF(AND(AK$30=$V$47,AK45=\"\",AK46=\"\",SUM($Y$47:AJ47)=0),1,\"\")","v":""},null,null,null,null,null,null,null,null,null,null,null,null,null,null,null,null,null,null,41]
[null,null,null,null,null,null,null,null,null,null,null,null,null,null,null,null,null,null,null,null,null,null,null,null,null,null,null,null,null,null,null,null,null,null,null,null,null,null,null,null,null,null,null,null,null,null,null,null,null,null,null,null,null,null,null,42]
[null,null,null,null,null,null,null,null,null,null,null,null,null,null,null,null,null,null,null,null,null,null,null,null,null,null,null,null,null,null,null,null,null,null,null,null,null,null,null,null,null,null,null,null,null,null,null,null,null,null,null,null,null,null,null,43]
[null,null,null,null,null,null,null,null,null,null,null,null,null,null,null,null,{"$f":"IF(R50=\"\",\"\",VLOOKUP(R50,Planning_général!$E$17:$F$62,2,0))","v":""},{"$f":"IF(W50=1,$W$3,IF(X50=1,$X$3,IF(Y50=1,$Y$3,IF(Z50=1,$Z$3,IF(AA50=1,$AA$3,IF(AB50=1,$AB$3,IF(AC50=1,$AC$3,IF(AD50=1,$AD$3,IF(AE50=1,$AE$3,IF(AF50=1,$AF$3,IF(AG50=1,$AG$3,IF(AH50=1,$AH$3,IF(AI50=1,$AI$3,IF(AJ50=1,$AJ$3,IF(AK50=1,$AK$3,\"\")))))))))))))))","v":""},{"$f":"IF(U50=1,U$9,IF(V50=1,V$9,IF(W50=1,W$9,IF(X50=1,X$9,IF(Y50=1,Y$9,IF(Z50=1,Z$9,IF(AA50=1,AA$9,IF(AB50=1,AB$9,IF(AC50=1,AC$9,IF(AD50=1,AD$9,IF(AE50=1,AE$9,\"\")))))))))))","v":""},"Matin",null,"M3",{"$f":"IF($V$50=$W$30,1,\"\")","v":""},{"$f":"IF(AND($V$50=$X$30,W50=\"\"),1,\"\")","v":""},{"$f":"IF(AND($V$50=$Y$30,X50=\"\",W50=\"\"),1,\"\")","v":""},{"$f":"IF(AND($V$50=Z40,W50=\"\",X50=\"\",Y50=\"\"),1,\"\")","v":""},{"$f":"IF(AND($V$50=$AA$30,X50=\"\",Y50=\"\",Z50=\"\",W50=\"\"),1,\"\")","v":""},{"$f":"IF(AND($V$50=$AB$30,Y50=\"\",Z50=\"\",AA50=\"\",X50=\"\",W50=\"\"),1,\"\")","v":""},{"$f":"IF(AND($V$50=AC40,Z50=\"\",AA50=\"\",AB50=\"\",Y50=\"\",X50=\"\",W50=\"\"),1,\"\")","v":""},{"$f":"IF(AND($V$50=AD40,AA50=\"\",AB50=\"\",AC50=\"\",Z50=\"\",Y50=\"\",X50=\"\",W50=\"\"),1,\"\")","v":""},{"$f":"IF(AND($V$50=$AE$30,AB50=\"\",AC50=\"\",AD50=\"\",AA50=\"\",Z50=\"\",Y50=\"\",X50=\"\",W50=\"\"),1,\"\")","v":""},{"$f":"IF(AND($V$50=$AF$30,AC50=\"\",AD50=\"\",AE50=\"\",AB50=\"\",AA50=\"\",Z50=\"\",Y50=\"\",X50=\"\",W50=\"\"),1,\"\")","v":""},{"$f":"IF(AND($V$50=$AG$30,AD50=\"\",AE50=\"\",AF50=\"\",AC50=\"\",AB50=\"\",AA50=\"\",Z50=\"\",Y50=\"\",X50=\"\",W50=\"\"),1,\"\")","v":""},{"$f":"IF(AND($V$50=$AH$30,AE50=\"\",AF50=\"\",AG50=\"\",AD50=\"\",AC50=\"\",AB50=\"\",AA50=\"\",Z50=\"\",Y50=\"\",X50=\"\",W50=\"\"),1,\"\")","v":""},{"$f":"IF(AND($V$50=$AI$30,AF50=\"\",AG50=\"\",AH50=\"\",AE50=\"\",AD50=\"\",AC50=\"\",AB50=\"\",AA50=\"\",Z50=\"\",Y50=\"\",X50=\"\",W50=\"\"),1,\"\")","v":""},{"$f":"IF(AND($V$50=$AJ$30,AG50=\"\",AH50=\"\",AI50=\"\",AF50=\"\",AE50=\"\",AD50=\"\",AC50=\"\",AB50=\"\",AA50=\"\",Z50=\"\",Y50=\"\",X50=\"\",W50=\"\"),1,\"\")","v":""},{"$f":"IF(AND($V$50=$AK$30,AH50=\"\",AI50=\"\",AJ50=\"\",AG50=\"\",AF50=\"\",AE50=\"\",AD50=\"\",AC50=\"\",AB50=\"\",AA50=\"\",Z50=\"\",Y50=\"\",X50=\"\",W50=\"\"),1,\"\")","v":""},null,null,null,null,null,null,null,null,null,null,null,null,null,null,null,null,null,null,44]
[null,null,null,null,null,null,null,null,null,null,null,null,null,null,null,null,{"$f":"IF(R51=\"\",\"\",VLOOKUP(R51,Planning_général!$E$17:$F$62,2,0))","v":""},{"$f":"IF(W51=1,$W$3,IF(X51=1,$X$3,IF(Y51=1,$Y$3,IF(Z51=1,$Z$3,IF(AA51=1,$AA$3,IF(AB51=1,$AB$3,IF(AC51=1,$AC$3,IF(AD51=1,$AD$3,IF(AE51=1,$AE$3,IF(AF51=1,$AF$3,IF(AG51=1,$AG$3,IF(AH51=1,$AH$3,IF(AI51=1,$AI$3,IF(AJ51=1,$AJ$3,IF(AK51=1,$AK$3,\"\")))))))))))))))","v":""},{"$f":"IF(U51=1,U$9,IF(V51=1,V$9,IF(W51=1,W$9,IF(X51=1,X$9,IF(Y51=1,Y$9,IF(Z51=1,Z$9,IF(AA51=1,AA$9,IF(AB51=1,AB$9,IF(AC51=1,AC$9,IF(AD51=1,AD$9,IF(AE51=1,AE$9,\"\")))))))))))","v":""},null,null,"M3",null,{"$f":"IF(AND(X$30=$V$51,W51=\"\",X50=\"\"),1,\"\")","v":""},{"$f":"IF(AND(Y$30=$V$51,X51=\"\",Y50=\"\"),1,\"\")","v":""},{"$f":"IF(AND(Z$30=$V$51,Y51=\"\",Z50=\"\"),1,\"\")","v":""},{"$f":"IF(AND(AA$30=$V$51,AA50=\"\",SUM($X$51:Z51)=0),1,\"\")","v":""},{"$f":"IF(AND(AB$30=$V$51,AB50=\"\",SUM($X$51:AA51)=0),1,\"\")","v":""},{"$f":"IF(AND(AC$30=$V$51,AC50=\"\",SUM($X$51:AB51)=0),1,\"\")","v":""},{"$f":"IF(AND(AD$30=$V$51,AD50=\"\",SUM($X$51:AC51)=0),1,\"\")","v":""},{"$f":"IF(AND(AE$30=$V$51,AE50=\"\",SUM($X$51:AD51)=0),1,\"\")","v":""},{"$f":"IF(AND(AF$30=$V$51,AF50=\"\",SUM($X$51:AE51)=0),1,\"\")","v":""},{"$f":"IF(AND(AG$30=$V$51,AG50=\"\",SUM($X$51:AF51)=0),1,\"\")","v":""},{"$f":"IF(AND(AH$30=$V$51,AH50=\"\",SUM($X$51:AG51)=0),1,\"\")","v":""},{"$f":"IF(AND(AI$30=$V$51,AI50=\"\",SUM($X$51:AH51)=0),1,\"\")","v":""},{"$f":"IF(AND(AJ$30=$V$51,AJ50=\"\",SUM($X$51:AI51)=0),1,\"\")","v":""},{"$f":"IF(AND(AK$30=$V$51,AK50=\"\",SUM($X$51:AJ51)=0),1,\"\")","v":""},null,null,null,null,null,null,null,null,null,null,null,null,null,null,null,null,null,null,45]
[null,null,null,null,null,null,null,null,null,null,null,null,null,null,null,null,{"$f":"IF(R52=\"\",\"\",VLOOKUP(R52,Planning_général!$E$17:$F$62,2,0))","v":""},{"$f":"IF(W52=1,$W$3,IF(X52=1,$X$3,IF(Y52=1,$Y$3,IF(Z52=1,$Z$3,IF(AA52=1,$AA$3,IF(AB52=1,$AB$3,IF(AC52=1,$AC$3,IF(AD52=1,$AD$3,IF(AE52=1,$AE$3,IF(AF52=1,$AF$3,IF(AG52=1,$AG$3,IF(AH52=1,$AH$3,IF(AI52=1,$AI$3,IF(AJ52=1,$AJ$3,IF(AK52=1,$AK$3,\"\")))))))))))))))","v":""},{"$f":"IF(U52=1,U$9,IF(V52=1,V$9,IF(W52=1,W$9,IF(X52=1,X$9,IF(Y52=1,Y$9,IF(Z52=1,Z$9,IF(AA52=1,AA$9,IF(AB52=1,AB$9,IF(AC52=1,AC$9,IF(AD52=1,AD$9,IF(AE52=1,AE$9,\"\")))))))))))","v":""},null,null,"-",null,null,{"$f":"IF(AND(Y$30=V52,X52=\"\",Y51=\"\",Y50=\"\"),1,\"\")","v":""},{"$f":"IF(AND(Z$30=V52,Y52=\"\",Z51=\"\",Z50=\"\"),1,\"\")","v":""},{"$f":"IF(AND(AA$30=$V$52,AA50=\"\",AA51=\"\",SUM($Y$52:Z52)=0),1,\"\")","v":""},{"$f":"IF(AND(AB$30=$V$52,AB50=\"\",AB51=\"\",SUM($Y$52:AA52)=0),1,\"\")","v":""},{"$f":"IF(AND(AC$30=$V$52,AC50=\"\",AC51=\"\",SUM($Y$52:AB52)=0),1,\"\")","v":""},{"$f":"IF(AND(AD$30=$V$52,AD50=\"\",AD51=\"\",SUM($Y$52:AC52)=0),1,\"\")","v":""},{"$f":"IF(AND(AE$30=$V$52,AE50=\"\",AE51=\"\",SUM($Y$52:AD52)=0),1,\"\")","v":""},{"$f":"IF(AND(AF$30=$V$52,AF50=\"\",AF51=\"\",SUM($Y$52:AE52)=0),1,\"\")","v":""},{"$f":"IF(AND(AG$30=$V$52,AG50=\"\",AG51=\"\",SUM($Y$52:AF52)=0),1,\"\")","v":""},{"$f":"IF(AND(AH$30=$V$52,AH50=\"\",AH51=\"\",SUM($Y$52:AG52)=0),1,\"\")","v":""},{"$f":"IF(AND(AI$30=$V$52,AI50=\"\",AI51=\"\",SUM($Y$52:AH52)=0),1,\"\")","v":""},{"$f":"IF(AND(AJ$30=$V$52,AJ50=\"\",AJ51=\"\",SUM($Y$52:AI52)=0),1,\"\")","v":""},{"$f":"IF(AND(AK$30=$V$52,AK50=\"\",AK51=\"\",SUM($Y$52:AJ52)=0),1,\"\")","v":""},null,null,null,null,null,null,null,null,null,null,null,null,null,null,null,null,null,null,46]
[null,null,null,null,null,null,null,null,null,null,null,null,null,null,null,null,null,null,null,null,null,null,null,null,null,null,null,null,null,null,null,null,null,null,null,null,null,null,null,null,null,null,null,null,null,null,null,null,null,null,null,null,null,null,null,47]
[null,null,null,null,null,null,null,null,null,null,null,null,null,null,null,null,null,null,null,null,null,null,null,null,null,null,null,null,null,null,null,null,null,null,null,null,null,null,null,null,null,null,null,null,null,null,null,null,null,null,null,null,null,null,null,48]
[null,null,null,null,null,null,null,null,null,null,null,null,null,null,null,null,{"$f":"IF(R55=\"\",\"\",VLOOKUP(R55,Planning_général!$E$17:$F$62,2,0))","v":""},{"$f":"IF(W55=1,$W$3,IF(X55=1,$X$3,IF(Y55=1,$Y$3,IF(Z55=1,$Z$3,IF(AA55=1,$AA$3,IF(AB55=1,$AB$3,IF(AC55=1,$AC$3,IF(AD55=1,$AD$3,IF(AE55=1,$AE$3,IF(AF55=1,$AF$3,IF(AG55=1,$AG$3,IF(AH55=1,$AH$3,IF(AI55=1,$AI$3,IF(AJ55=1,$AJ$3,IF(AK55=1,$AK$3,\"\")))))))))))))))","v":""},{"$f":"IF(U55=1,U$9,IF(V55=1,V$9,IF(W55=1,W$9,IF(X55=1,X$9,IF(Y55=1,Y$9,IF(Z55=1,Z$9,IF(AA55=1,AA$9,IF(AB55=1,AB$9,IF(AC55=1,AC$9,IF(AD55=1,AD$9,IF(AE55=1,AE$9,\"\")))))))))))","v":""},"Après-midi",null,"AP1",{"$f":"IF($V$55=$W$30,1,\"\")","v":""},{"$f":"IF(AND($V$55=$X$30,W55=\"\"),1,\"\")","v":""},{"$f":"IF(AND($V$55=$Y$30,X55=\"\",W55=\"\"),1,\"\")","v":""},{"$f":"IF(AND($V$55=Z45,W55=\"\",X55=\"\",Y55=\"\"),1,\"\")","v":""},{"$f":"IF(AND($V$55=$AA$30,X55=\"\",Y55=\"\",Z55=\"\",W55=\"\"),1,\"\")","v":""},{"$f":"IF(AND($V$55=$AB$30,Y55=\"\",Z55=\"\",AA55=\"\",X55=\"\",W55=\"\"),1,\"\")","v":""},{"$f":"IF(AND($V$55=AC45,Z55=\"\",AA55=\"\",AB55=\"\",Y55=\"\",X55=\"\",W55=\"\"),1,\"\")","v":""},{"$f":"IF(AND($V$55=AD45,AA55=\"\",AB55=\"\",AC55=\"\",Z55=\"\",Y55=\"\",X55=\"\",W55=\"\"),1,\"\")","v":""},{"$f":"IF(AND($V$55=$AE$30,AB55=\"\",AC55=\"\",AD55=\"\",AA55=\"\",Z55=\"\",Y55=\"\",X55=\"\",W55=\"\"),1,\"\")","v":""},{"$f":"IF(AND($V$55=$AF$30,AC55=\"\",AD55=\"\",AE55=\"\",AB55=\"\",AA55=\"\",Z55=\"\",Y55=\"\",X55=\"\",W55=\"\"),1,\"\")","v":""},{"$f":"IF(AND($V$55=$AG$30,AD55=\"\",AE55=\"\",AF55=\"\",AC55=\"\",AB55=\"\",AA55=\"\",Z55=\"\",Y55=\"\",X55=\"\",W55=\"\"),1,\"\")","v":""},{"$f":"IF(AND($V$55=$AH$30,AE55=\"\",AF55=\"\",AG55=\"\",AD55=\"\",AC55=\"\",AB55=\"\",AA55=\"\",Z55=\"\",Y55=\"\",X55=\"\",W55=\"\"),1,\"\")","v":""},{"$f":"IF(AND($V$55=$AI$30,AF55=\"\",AG55=\"\",AH55=\"\",AE55=\"\",AD55=\"\",AC55=\"\",AB55=\"\",AA55=\"\",Z55=\"\",Y55=\"\",X55=\"\",W55=\"\"),1,\"\")","v":""},{"$f":"IF(AND($V$55=$AJ$30,AG55=\"\",AH55=\"\",AI55=\"\",AF55=\"\",AE55=\"\",AD55=\"\",AC55=\"\",AB55=\"\",AA55=\"\",Z55=\"\",Y55=\"\",X55=\"\",W55=\"\"),1,\"\")","v":""},{"$f":"IF(AND($V$55=$AK$30,AH55=\"\",AI55=\"\",AJ55=\"\",AG55=\"\",AF55=\"\",AE55=\"\",AD55=\"\",AC55=\"\",AB55=\"\",AA55=\"\",Z55=\"\",Y55=\"\",X55=\"\",W55=\"\"),1,\"\")","v":""},null,null,null,null,null,null,null,null,null,null,null,null,null,null,null,null,null,null,49]
[null,null,null,null,null,null,null,null,null,null,null,null,null,null,null,null,{"$f":"IF(R56=\"\",\"\",VLOOKUP(R56,Planning_général!$E$17:$F$62,2,0))","v":""},{"$f":"IF(W56=1,$W$3,IF(X56=1,$X$3,IF(Y56=1,$Y$3,IF(Z56=1,$Z$3,IF(AA56=1,$AA$3,IF(AB56=1,$AB$3,IF(AC56=1,$AC$3,IF(AD56=1,$AD$3,IF(AE56=1,$AE$3,IF(AF56=1,$AF$3,IF(AG56=1,$AG$3,IF(AH56=1,$AH$3,IF(AI56=1,$AI$3,IF(AJ56=1,$AJ$3,IF(AK56=1,$AK$3,\"\")))))))))))))))","v":""},{"$f":"IF(U56=1,U$9,IF(V56=1,V$9,IF(W56=1,W$9,IF(X56=1,X$9,IF(Y56=1,Y$9,IF(Z56=1,Z$9,IF(AA56=1,AA$9,IF(AB56=1,AB$9,IF(AC56=1,AC$9,IF(AD56=1,AD$9,IF(AE56=1,AE$9,\"\")))))))))))","v":""},null,null,"AP1",null,{"$f":"IF(AND(X$30=$V$56,W56=\"\",X55=\"\"),1,\"\")","v":""},{"$f":"IF(AND(Y$30=$V$56,X56=\"\",Y55=\"\"),1,\"\")","v":""},{"$f":"IF(AND(Z$30=$V$56,Y56=\"\",Z55=\"\"),1,\"\")","v":""},{"$f":"IF(AND(AA$30=$V$56,AA55=\"\",SUM($X$56:Z56)=0),1,\"\")","v":""},{"$f":"IF(AND(AB$30=$V$56,AB55=\"\",SUM($X$56:AA56)=0),1,\"\")","v":""},{"$f":"IF(AND(AC$30=$V$56,AC55=\"\",SUM($X$56:AB56)=0),1,\"\")","v":""},{"$f":"IF(AND(AD$30=$V$56,AD55=\"\",SUM($X$56:AC56)=0),1,\"\")","v":""},{"$f":"IF(AND(AE$30=$V$56,AE55=\"\",SUM($X$56:AD56)=0),1,\"\")","v":""},{"$f":"IF(AND(AF$30=$V$56,AF55=\"\",SUM($X$56:AE56)=0),1,\"\")","v":""},{"$f":"IF(AND(AG$30=$V$56,AG55=\"\",SUM($X$56:AF56)=0),1,\"\")","v":""},{"$f":"IF(AND(AH$30=$V$56,AH55=\"\",SUM($X$56:AG56)=0),1,\"\")","v":""},{"$f":"IF(AND(AI$30=$V$56,AI55=\"\",SUM($X$56:AH56)=0),1,\"\")","v":""},{"$f":"IF(AND(AJ$30=$V$56,AJ55=\"\",SUM($X$56:AI56)=0),1,\"\")","v":""},{"$f":"IF(AND(AK$30=$V$56,AK55=\"\",SUM($X$56:AJ56)=0),1,\"\")","v":""},null,null,null,null,null,null,null,null,null,null,null,null,null,null,null,null,null,null,50]
[null,null,null,null,null,null,null,null,null,null,null,null,null,null,null,null,{"$f":"IF(R57=\"\",\"\",VLOOKUP(R57,Planning_général!$E$17:$F$62,2,0))","v":""},{"$f":"IF(W57=1,$W$3,IF(X57=1,$X$3,IF(Y57=1,$Y$3,IF(Z57=1,$Z$3,IF(AA57=1,$AA$3,IF(AB57=1,$AB$3,IF(AC57=1,$AC$3,IF(AD57=1,$AD$3,IF(AE57=1,$AE$3,IF(AF57=1,$AF$3,IF(AG57=1,$AG$3,IF(AH57=1,$AH$3,IF(AI57=1,$AI$3,IF(AJ57=1,$AJ$3,IF(AK57=1,$AK$3,\"\")))))))))))))))","v":""},{"$f":"IF(U57=1,U$9,IF(V57=1,V$9,IF(W57=1,W$9,IF(X57=1,X$9,IF(Y57=1,Y$9,IF(Z57=1,Z$9,IF(AA57=1,AA$9,IF(AB57=1,AB$9,IF(AC57=1,AC$9,IF(AD57=1,AD$9,IF(AE57=1,AE$9,\"\")))))))))))","v":""},null,null,"-",null,null,{"$f":"IF(AND(Y$30=V57,X57=\"\",Y56=\"\",Y55=\"\"),1,\"\")","v":""},{"$f":"IF(AND(Z$30=V57,Y57=\"\",Z56=\"\",Z55=\"\"),1,\"\")","v":""},{"$f":"IF(AND(AA$30=$V$57,AA55=\"\",AA56=\"\",SUM($Y$52:Z57)=0),1,\"\")","v":""},{"$f":"IF(AND(AB$30=$V$57,AB55=\"\",AB56=\"\",SUM($Y$57:AA57)=0),1,\"\")","v":""},{"$f":"IF(AND(AC$30=$V$57,AC55=\"\",AC56=\"\",SUM($Y$57:AB57)=0),1,\"\")","v":""},{"$f":"IF(AND(AD$30=$V$57,AD55=\"\",AD56=\"\",SUM($Y$57:AC57)=0),1,\"\")","v":""},{"$f":"IF(AND(AE$30=$V$57,AE55=\"\",AE56=\"\",SUM($Y$57:AD57)=0),1,\"\")","v":""},{"$f":"IF(AND(AF$30=$V$57,AF55=\"\",AF56=\"\",SUM($Y$57:AE57)=0),1,\"\")","v":""},{"$f":"IF(AND(AG$30=$V$57,AG55=\"\",AG56=\"\",SUM($Y$57:AF57)=0),1,\"\")","v":""},{"$f":"IF(AND(AH$30=$V$57,AH55=\"\",AH56=\"\",SUM($Y$57:AG57)=0),1,\"\")","v":""},{"$f":"IF(AND(AI$30=$V$57,AI55=\"\",AI56=\"\",SUM($Y$57:AH57)=0),1,\"\")","v":""},{"$f":"IF(AND(AJ$30=$V$57,AJ55=\"\",AJ56=\"\",SUM($Y$57:AI57)=0),1,\"\")","v":""},{"$f":"IF(AND(AK$30=$V$57,AK55=\"\",AK56=\"\",SUM($Y$57:AJ57)=0),1,\"\")","v":""},null,null,null,null,null,null,null,null,null,null,null,null,null,null,null,null,null,null,51]
[null,null,null,null,null,null,null,null,null,null,null,null,null,null,null,null,null,null,null,null,null,null,null,null,null,null,null,null,null,null,null,null,null,null,null,null,null,null,null,null,null,null,null,null,null,null,null,null,null,null,null,null,null,null,null,52]
[null,null,null,null,null,null,null,null,null,null,null,null,null,null,null,null,null,null,null,null,null,null,null,null,null,null,null,null,null,null,null,null,null,null,null,null,null,null,null,null,null,null,null,null,null,null,null,null,null,null,null,null,null,null,null,53]
[null,null,null,null,null,null,null,null,null,null,null,null,null,null,null,null,{"$f":"IF(R60=\"\",\"\",VLOOKUP(R60,Planning_général!$E$17:$F$62,2,0))","v":""},{"$f":"IF(W60=1,$W$3,IF(X60=1,$X$3,IF(Y60=1,$Y$3,IF(Z60=1,$Z$3,IF(AA60=1,$AA$3,IF(AB60=1,$AB$3,IF(AC60=1,$AC$3,IF(AD60=1,$AD$3,IF(AE60=1,$AE$3,IF(AF60=1,$AF$3,IF(AG60=1,$AG$3,IF(AH60=1,$AH$3,IF(AI60=1,$AI$3,IF(AJ60=1,$AJ$3,IF(AK60=1,$AK$3,\"\")))))))))))))))","v":""},{"$f":"IF(U60=1,U$9,IF(V60=1,V$9,IF(W60=1,W$9,IF(X60=1,X$9,IF(Y60=1,Y$9,IF(Z60=1,Z$9,IF(AA60=1,AA$9,IF(AB60=1,AB$9,IF(AC60=1,AC$9,IF(AD60=1,AD$9,IF(AE60=1,AE$9,\"\")))))))))))","v":""},"Soir",null,"AP2",{"$f":"IF($V$60=$W$30,1,\"\")","v":""},{"$f":"IF(AND($V$60=$X$30,W60=\"\"),1,\"\")","v":""},{"$f":"IF(AND($V$60=$Y$30,X60=\"\",W60=\"\"),1,\"\")","v":""},{"$f":"IF(AND($V$60=$Z$30,W60=\"\",X60=\"\",Y60=\"\"),1,\"\")","v":""},{"$f":"IF(AND($V$60=$AA$30,X60=\"\",Y60=\"\",Z60=\"\",W60=\"\"),1,\"\")","v":""},{"$f":"IF(AND($V$60=$AB$30,Y60=\"\",Z60=\"\",AA60=\"\",X60=\"\",W60=\"\"),1,\"\")","v":""},{"$f":"IF(AND($V$60=AC50,Z60=\"\",AA60=\"\",AB60=\"\",Y60=\"\",X60=\"\",W60=\"\"),1,\"\")","v":""},{"$f":"IF(AND($V$60=AD50,AA60=\"\",AB60=\"\",AC60=\"\",Z60=\"\",Y60=\"\",X60=\"\",W60=\"\"),1,\"\")","v":""},{"$f":"IF(AND($V$60=$AE$30,AB60=\"\",AC60=\"\",AD60=\"\",AA60=\"\",Z60=\"\",Y60=\"\",X60=\"\",W60=\"\"),1,\"\")","v":""},{"$f":"IF(AND($V$60=$AF$30,AC60=\"\",AD60=\"\",AE60=\"\",AB60=\"\",AA60=\"\",Z60=\"\",Y60=\"\",X60=\"\",W60=\"\"),1,\"\")","v":""},{"$f":"IF(AND($V$60=$AG$30,AD60=\"\",AE60=\"\",AF60=\"\",AC60=\"\",AB60=\"\",AA60=\"\",Z60=\"\",Y60=\"\",X60=\"\",W60=\"\"),1,\"\")","v":""},{"$f":"IF(AND($V$60=$AH$30,AE60=\"\",AF60=\"\",AG60=\"\",AD60=\"\",AC60=\"\",AB60=\"\",AA60=\"\",Z60=\"\",Y60=\"\",X60=\"\",W60=\"\"),1,\"\")","v":""},{"$f":"IF(AND($V$60=$AI$30,AF60=\"\",AG60=\"\",AH60=\"\",AE60=\"\",AD60=\"\",AC60=\"\",AB60=\"\",AA60=\"\",Z60=\"\",Y60=\"\",X60=\"\",W60=\"\"),1,\"\")","v":""},{"$f":"IF(AND($V$60=$AJ$30,AG60=\"\",AH60=\"\",AI60=\"\",AF60=\"\",AE60=\"\",AD60=\"\",AC60=\"\",AB60=\"\",AA60=\"\",Z60=\"\",Y60=\"\",X60=\"\",W60=\"\"),1,\"\")","v":""},{"$f":"IF(AND($V$60=$AK$30,AH60=\"\",AI60=\"\",AJ60=\"\",AG60=\"\",AF60=\"\",AE60=\"\",AD60=\"\",AC60=\"\",AB60=\"\",AA60=\"\",Z60=\"\",Y60=\"\",X60=\"\",W60=\"\"),1,\"\")","v":""}]
[null,null,null,null,null,null,null,null,null,null,null,null,null,null,null,null,{"$f":"IF(R61=\"\",\"\",VLOOKUP(R61,Planning_général!$E$17:$F$62,2,0))","v":""},{"$f":"IF(W61=1,$W$3,IF(X61=1,$X$3,IF(Y61=1,$Y$3,IF(Z61=1,$Z$3,IF(AA61=1,$AA$3,IF(AB61=1,$AB$3,IF(AC61=1,$AC$3,IF(AD61=1,$AD$3,IF(AE61=1,$AE$3,IF(AF61=1,$AF$3,IF(AG61=1,$AG$3,IF(AH61=1,$AH$3,IF(AI61=1,$AI$3,IF(AJ61=1,$AJ$3,IF(AK61=1,$AK$3,\"\")))))))))))))))","v":""},{"$f":"IF(U61=1,U$9,IF(V61=1,V$9,IF(W61=1,W$9,IF(X61=1,X$9,IF(Y61=1,Y$9,IF(Z61=1,Z$9,IF(AA61=1,AA$9,IF(AB61=1,AB$9,IF(AC61=1,AC$9,IF(AD61=1,AD$9,IF(AE61=1,AE$9,\"\")))))))))))","v":""},null,null,"AP2",null,{"$f":"IF(AND(X$30=$V$61,W61=\"\",X60=\"\"),1,\"\")","v":""},{"$f":"IF(AND(Y$30=$V$61,X61=\"\",Y60=\"\"),1,\"\")","v":""},{"$f":"IF(AND(Z$30=$V$61,Y61=\"\",Z60=\"\"),1,\"\")","v":""},{"$f":"IF(AND(AA$30=$V$61,AA60=\"\",SUM($X$61:Z61)=0),1,\"\")","v":""},{"$f":"IF(AND(AB$30=$V$61,AB60=\"\",SUM($X$61:AA61)=0),1,\"\")","v":""},{"$f":"IF(AND(AC$30=$V$61,AC60=\"\",SUM($X$61:AB61)=0),1,\"\")","v":""},{"$f":"IF(AND(AD$30=$V$61,AD60=\"\",SUM($X$61:AC61)=0),1,\"\")","v":""},{"$f":"IF(AND(AE$30=$V$61,AE60=\"\",SUM($X$61:AD61)=0),1,\"\")","v":""},{"$f":"IF(AND(AF$30=$V$61,AF60=\"\",SUM($X$61:AE61)=0),1,\"\")","v":""},{"$f":"IF(AND(AG$30=$V$61,AG60=\"\",SUM($X$61:AF61)=0),1,\"\")","v":""},{"$f":"IF(AND(AH$30=$V$61,AH60=\"\",SUM($X$61:AG61)=0),1,\"\")","v":""},{"$f":"IF(AND(AI$30=$V$61,AI60=\"\",SUM($X$61:AH61)=0),1,\"\")","v":""},{"$f":"IF(AND(AJ$30=$V$61,AJ60=\"\",SUM($X$61:AI61)=0),1,\"\")","v":""},{"$f":"IF(AND(AK$30=$V$61,AK60=\"\",SUM($X$61:AJ61)=0),1,\"\")","v":""}]
[null,null,null,null,null,null,null,null,null,null,null,null,null,null,null,null,{"$f":"IF(R62=\"\",\"\",VLOOKUP(R62,Planning_général!$E$17:$F$62,2,0))","v":""},{"$f":"IF(W62=1,$W$3,IF(X62=1,$X$3,IF(Y62=1,$Y$3,IF(Z62=1,$Z$3,IF(AA62=1,$AA$3,IF(AB62=1,$AB$3,IF(AC62=1,$AC$3,IF(AD62=1,$AD$3,IF(AE62=1,$AE$3,IF(AF62=1,$AF$3,IF(AG62=1,$AG$3,IF(AH62=1,$AH$3,IF(AI62=1,$AI$3,IF(AJ62=1,$AJ$3,IF(AK62=1,$AK$3,\"\")))))))))))))))","v":""},{"$f":"IF(U62=1,U$9,IF(V62=1,V$9,IF(W62=1,W$9,IF(X62=1,X$9,IF(Y62=1,Y$9,IF(Z62=1,Z$9,IF(AA62=1,AA$9,IF(AB62=1,AB$9,IF(AC62=1,AC$9,IF(AD62=1,AD$9,IF(AE62=1,AE$9,\"\")))))))))))","v":""},null,null,"-",null,null,{"$f":"IF(AND(Y$30=V62,X62=\"\",Y61=\"\",Y60=\"\"),1,\"\")","v":""},{"$f":"IF(AND(Z$30=V62,Y62=\"\",Z61=\"\",Z60=\"\"),1,\"\")","v":""},{"$f":"IF(AND(AA$30=$V$62,AA60=\"\",AA61=\"\",SUM($Y$62:Z62)=0),1,\"\")","v":""},{"$f":"IF(AND(AB$30=$V$62,AB60=\"\",AB61=\"\",SUM($Y$62:AA62)=0),1,\"\")","v":""},{"$f":"IF(AND(AC$30=$V$62,AC60=\"\",AC61=\"\",SUM($Y$62:AB62)=0),1,\"\")","v":""},{"$f":"IF(AND(AD$30=$V$62,AD60=\"\",AD61=\"\",SUM($Y$62:AC62)=0),1,\"\")","v":""},{"$f":"IF(AND(AE$30=$V$62,AE60=\"\",AE61=\"\",SUM($Y$62:AD62)=0),1,\"\")","v":""},{"$f":"IF(AND(AF$30=$V$62,AF60=\"\",AF61=\"\",SUM($Y$62:AE62)=0),1,\"\")","v":""},{"$f":"IF(AND(AG$30=$V$62,AG60=\"\",AG61=\"\",SUM($Y$62:AF62)=0),1,\"\")","v":""},{"$f":"IF(AND(AH$30=$V$62,AH60=\"\",AH61=\"\",SUM($Y$62:AG62)=0),1,\"\")","v":""},{"$f":"IF(AND(AI$30=$V$62,AI60=\"\",AI61=\"\",SUM($Y$62:AH62)=0),1,\"\")","v":""},{"$f":"IF(AND(AJ$30=$V$62,AJ60=\"\",AJ61=\"\",SUM($Y$62:AI62)=0),1,\"\")","v":""},{"$f":"IF(AND(AK$30=$V$62,AK60=\"\",AK61=\"\",SUM($Y$62:AJ62)=0),1,\"\")","v":""}]
[]
[]
[null,null,null,null,null,null,null,null,null,null,null,null,null,null,null,null,null,{"$f":"IF(W65=1,$W$3,IF(X65=1,$X$3,IF(Y65=1,$Y$3,IF(Z65=1,$Z$3,IF(AA65=1,$AA$3,IF(AB65=1,$AB$3,IF(AC65=1,$AC$3,IF(AD65=1,$AD$3,IF(AE65=1,$AE$3,IF(AF65=1,$AF$3,IF(AG65=1,$AG$3,IF(AH65=1,$AH$3,IF(AI65=1,$AI$3,IF(AJ65=1,$AJ$3,IF(AK65=1,$AK$3,\"\")))))))))))))))","v":""},{"$f":"IF(U65=1,U$9,IF(V65=1,V$9,IF(W65=1,W$9,IF(X65=1,X$9,IF(Y65=1,Y$9,IF(Z65=1,Z$9,IF(AA65=1,AA$9,IF(AB65=1,AB$9,IF(AC65=1,AC$9,IF(AD65=1,AD$9,IF(AE65=1,AE$9,\"\")))))))))))","v":""},"Nuit",null,"-",{"$f":"IF($V$65=$W$30,1,\"\")","v":""},{"$f":"IF(AND($V$65=$X$30,W65=\"\"),1,\"\")","v":""},{"$f":"IF(AND($V$65=$Y$30,X65=\"\",W65=\"\"),1,\"\")","v":""},{"$f":"IF(AND($V$65=$Z$30,W65=\"\",X65=\"\",Y65=\"\"),1,\"\")","v":""},{"$f":"IF(AND($V$65=$AA$30,X65=\"\",Y65=\"\",Z65=\"\",W65=\"\"),1,\"\")","v":""},{"$f":"IF(AND($V$65=$AB$30,Y65=\"\",Z65=\"\",AA65=\"\",X65=\"\",W65=\"\"),1,\"\")","v":""},{"$f":"IF(AND($V$65=AC55,Z65=\"\",AA65=\"\",AB65=\"\",Y65=\"\",X65=\"\",W65=\"\"),1,\"\")","v":""},{"$f":"IF(AND($V$65=AD30,AA65=\"\",AB65=\"\",AC65=\"\",Z65=\"\",Y65=\"\",X65=\"\",W65=\"\"),1,\"\")","v":""},{"$f":"IF(AND($V$65=$AE$30,AB65=\"\",AC65=\"\",AD65=\"\",AA65=\"\",Z65=\"\",Y65=\"\",X65=\"\",W65=\"\"),1,\"\")","v":""},{"$f":"IF(AND($V$65=$AF$30,AC65=\"\",AD65=\"\",AE65=\"\",AB65=\"\",AA65=\"\",Z65=\"\",Y65=\"\",X65=\"\",W65=\"\"),1,\"\")","v":""},{"$f":"IF(AND($V$65=$AG$30,AD65=\"\",AE65=\"\",AF65=\"\",AC65=\"\",AB65=\"\",AA65=\"\",Z65=\"\",Y65=\"\",X65=\"\",W65=\"\"),1,\"\")","v":""},{"$f":"IF(AND($V$65=$AH$30,AE65=\"\",AF65=\"\",AG65=\"\",AD65=\"\",AC65=\"\",AB65=\"\",AA65=\"\",Z65=\"\",Y65=\"\",X65=\"\",W65=\"\"),1,\"\")","v":""},{"$f":"IF(AND($V$65=$AI$30,AF65=\"\",AG65=\"\",AH65=\"\",AE65=\"\",AD65=\"\",AC65=\"\",AB65=\"\",AA65=\"\",Z65=\"\",Y65=\"\",X65=\"\",W65=\"\"),1,\"\")","v":""},{"$f":"IF(AND($V$65=$AJ$30,AG65=\"\",AH65=\"\",AI65=\"\",AF65=\"\",AE65=\"\",AD65=\"\",AC65=\"\",AB65=\"\",AA65=\"\",Z65=\"\",Y65=\"\",X65=\"\",W65=\"\"),1,\"\")","v":""},{"$f":"IF(AND($V$65=$AK$30,AH65=\"\",AI65=\"\",AJ65=\"\",AG65=\"\",AF65=\"\",AE65=\"\",AD65=\"\",AC65=\"\",AB65=\"\",AA65=\"\",Z65=\"\",Y65=\"\",X65=\"\",W65=\"\"),1,\"\")","v":""}]
[null,null,null,null,null,null,null,null,null,null,null,null,null,null,null,null,null,{"$f":"IF(W66=1,$W$3,IF(X66=1,$X$3,IF(Y66=1,$Y$3,IF(Z66=1,$Z$3,IF(AA66=1,$AA$3,IF(AB66=1,$AB$3,IF(AC66=1,$AC$3,IF(AD66=1,$AD$3,IF(AE66=1,$AE$3,IF(AF66=1,$AF$3,IF(AG66=1,$AG$3,IF(AH66=1,$AH$3,IF(AI66=1,$AI$3,IF(AJ66=1,$AJ$3,IF(AK66=1,$AK$3,\"\")))))))))))))))","v":""},{"$f":"IF(U66=1,U$9,IF(V66=1,V$9,IF(W66=1,W$9,IF(X66=1,X$9,IF(Y66=1,Y$9,IF(Z66=1,Z$9,IF(AA66=1,AA$9,IF(AB66=1,AB$9,IF(AC66=1,AC$9,IF(AD66=1,AD$9,IF(AE66=1,AE$9,\"\")))))))))))","v":""},null,null,"-",null,{"$f":"IF(AND(X$30=$V$66,W66=\"\",X65=\"\"),1,\"\")","v":""},{"$f":"IF(AND(Y$30=$V$66,X66=\"\",Y65=\"\"),1,\"\")","v":""},{"$f":"IF(AND(Z$30=$V$66,Y66=\"\",Z65=\"\"),1,\"\")","v":""},{"$f":"IF(AND(AA$30=$V$66,AA65=\"\",SUM($X$66:Z66)=0),1,\"\")","v":""},{"$f":"IF(AND(AB$30=$V$66,AB65=\"\",SUM($X$66:AA66)=0),1,\"\")","v":""},{"$f":"IF(AND(AC$30=$V$66,AC65=\"\",SUM($X$66:AB66)=0),1,\"\")","v":""},{"$f":"IF(AND(AD$30=$V$66,AD65=\"\",SUM($X$66:AC66)=0),1,\"\")","v":""},{"$f":"IF(AND(AE$30=$V$66,AE65=\"\",SUM($X$66:AD66)=0),1,\"\")","v":""},{"$f":"IF(AND(AF$30=$V$66,AF65=\"\",SUM($X$66:AE66)=0),1,\"\")","v":""},{"$f":"IF(AND(AG$30=$V$66,AG65=\"\",SUM($X$66:AF66)=0),1,\"\")","v":""},{"$f":"IF(AND(AH$30=$V$66,AH65=\"\",SUM($X$66:AG66)=0),1,\"\")","v":""},{"$f":"IF(AND(AI$30=$V$66,AI65=\"\",SUM($X$66:AH66)=0),1,\"\")","v":""},{"$f":"IF(AND(AJ$30=$V$66,AJ65=\"\",SUM($X$66:AI66)=0),1,\"\")","v":""},{"$f":"IF(AND(AK$30=$V$66,AK65=\"\",SUM($X$66:AJ66)=0),1,\"\")","v":""}]
[null,null,null,null,null,null,null,null,null,null,null,null,null,null,null,null,null,{"$f":"IF(W67=1,$W$3,IF(X67=1,$X$3,IF(Y67=1,$Y$3,IF(Z67=1,$Z$3,IF(AA67=1,$AA$3,IF(AB67=1,$AB$3,IF(AC67=1,$AC$3,IF(AD67=1,$AD$3,IF(AE67=1,$AE$3,IF(AF67=1,$AF$3,IF(AG67=1,$AG$3,IF(AH67=1,$AH$3,IF(AI67=1,$AI$3,IF(AJ67=1,$AJ$3,IF(AK67=1,$AK$3,\"\")))))))))))))))","v":""},{"$f":"IF(U67=1,U$9,IF(V67=1,V$9,IF(W67=1,W$9,IF(X67=1,X$9,IF(Y67=1,Y$9,IF(Z67=1,Z$9,IF(AA67=1,AA$9,IF(AB67=1,AB$9,IF(AC67=1,AC$9,IF(AD67=1,AD$9,IF(AE67=1,AE$9,\"\")))))))))))","v":""},null,null,"-",null,null,{"$f":"IF(AND(Y$30=V67,X67=\"\",Y66=\"\",Y65=\"\"),1,\"\")","v":""},{"$f":"IF(AND(Z$30=V67,Y67=\"\",Z66=\"\",Z65=\"\"),1,\"\")","v":""},{"$f":"IF(AND(AA$30=$V$67,AA65=\"\",AA66=\"\",SUM($Y$67:Z67)=0),1,\"\")","v":""},{"$f":"IF(AND(AB$30=$V$67,AB65=\"\",AB66=\"\",SUM($Y$67:AA67)=0),1,\"\")","v":""},{"$f":"IF(AND(AC$30=$V$67,AC65=\"\",AC66=\"\",SUM($Y$67:AB67)=0),1,\"\")","v":""},{"$f":"IF(AND(AD$30=$V$67,AD65=\"\",AD66=\"\",SUM($Y$67:AC67)=0),1,\"\")","v":""},{"$f":"IF(AND(AE$30=$V$67,AE65=\"\",AE66=\"\",SUM($Y$67:AD67)=0),1,\"\")","v":""},{"$f":"IF(AND(AF$30=$V$67,AF65=\"\",AF66=\"\",SUM($Y$67:AE67)=0),1,\"\")","v":""},{"$f":"IF(AND(AG$30=$V$67,AG65=\"\",AG66=\"\",SUM($Y$67:AF67)=0),1,\"\")","v":""},{"$f":"IF(AND(AH$30=$V$67,AH65=\"\",AH66=\"\",SUM($Y$67:AG67)=0),1,\"\")","v":""},{"$f":"IF(AND(AI$30=$V$67,AI65=\"\",AI66=\"\",SUM($Y$67:AH67)=0),1,\"\")","v":""},{"$f":"IF(AND(AJ$30=$V$67,AJ65=\"\",AJ66=\"\",SUM($Y$67:AI67)=0),1,\"\")","v":""},{"$f":"IF(AND(AK$30=$V$67,AK65=\"\",AK66=\"\",SUM($Y$67:AJ67)=0),1,\"\")","v":""}]
[]
[]
[]
[null,null,null,null,null,null,null,null,null,null,null,null,null,null,{"$f":"V71","v":"Mardi"},{"$f":"LEN(Q71)","v":0},{"$f":"(CONCATENATE(IF(W71=1,CONCATENATE(\"-\",W$3,\"(\",W10,\")\"),\"\"),IF(X71=1,CONCATENATE(\"-\",X$3,\"(\",X10,\")\"),\"\"),IF(Y71=1,CONCATENATE(\"-\",Y$3,\"(\",Y10,\")\"),\"\"),IF(Z71=1,CONCATENATE(\"-\",Z$3,\"(\",Z10,\")\"),\"\"),IF(AA71=1,CONCATENATE(\"-\",AA$3,\"(\",AA10,\")\"),\"\"),IF(AB71=1,CONCATENATE(\"-\",AB$3,\"(\",AB10,\")\"),\"\"),IF(AC71=1,CONCATENATE(\"-\",AC$3,\"(\",AC10,\")\"),\"\"),IF(AD71=1,CONCATENATE(\"-\",AD$3,\"(\",AD10,\")\"),\"\"),IF(AE71=1,CONCATENATE(\"-\",AE$3,\"(\",AE10,\")\"),\"\"),IF(AF71=1,CONCATENATE(\"-\",AF$3,\"(\",AF10,\")\"),\"\"),IF(AG71=1,CONCATENATE(\"-\",AG$3,\"(\",AG10,\")\"),\"\"),IF(AH71=1,CONCATENATE(\"-\",AH$3,\"(\",AH10,\")\"),\"\"),IF(AI71=1,CONCATENATE(\"-\",AI$3,\"(\",AI10,\")\"),\"\"),IF(AJ71=1,CONCATENATE(\"-\",AJ$3,\"(\",AJ10,\")\"),\"\"),IF(AK71=1,CONCATENATE(\"-\",AK$3,\"(\",AK10,\")\"),\"\")))","v":""},null,null,null,null,{"$f":"V10","v":"Mardi"},{"$f":"IF((COUNTIF(W10,$AM$71)+COUNTIF(W10,$AM$72)+COUNTIF(W10,$AM$73)+COUNTIF(W10,$AM$74)+COUNTIF(W10,$AM$75)+COUNTIF(W10,$AM$76)+COUNTIF(W10,$AM$77)+COUNTIF(W10,$AM$78)+COUNTIF(W10,$AM$79)+COUNTIF(W10,$AM$80)+COUNTIF(W10,$AM$81))=0,\"\",COUNTIF(W10,$AM$71)+COUNTIF(W10,$AM$72)+COUNTIF(W10,$AM$73)+COUNTIF(W10,$AM$74)+COUNTIF(W10,$AM$75)+COUNTIF(W10,$AM$76)+COUNTIF(W10,$AM$77)+COUNTIF(W10,$AM$78)+COUNTIF(W10,$AM$79)+COUNTIF(W10,$AM$80)+COUNTIF(W10,$AM$81))","v":""},{"$f":"IF((COUNTIF(X10,$AM$71)+COUNTIF(X10,$AM$72)+COUNTIF(X10,$AM$73)+COUNTIF(X10,$AM$74)+COUNTIF(X10,$AM$75)+COUNTIF(X10,$AM$76)+COUNTIF(X10,$AM$77)+COUNTIF(X10,$AM$78)+COUNTIF(X10,$AM$79)+COUNTIF(X10,$AM$80)+COUNTIF(X10,$AM$81))=0,\"\",COUNTIF(X10,$AM$71)+COUNTIF(X10,$AM$72)+COUNTIF(X10,$AM$73)+COUNTIF(X10,$AM$74)+COUNTIF(X10,$AM$75)+COUNTIF(X10,$AM$76)+COUNTIF(X10,$AM$77)+COUNTIF(X10,$AM$78)+COUNTIF(X10,$AM$79)+COUNTIF(X10,$AM$80)+COUNTIF(X10,$AM$81))","v":""},"","","","","","","","","","","","","",null,"CP"]
[null,null,null,null,null,null,null,null,null,null,null,null,null,null,{"$f":"V72","v":"Mercredi"},{"$f":"LEN(Q72)","v":0},"",null,null,null,null,"Mercredi",{"$f":"IF((COUNTIF(W11,$AM$71)+COUNTIF(W11,$AM$72)+COUNTIF(W11,$AM$73)+COUNTIF(W11,$AM$74)+COUNTIF(W11,$AM$75)+COUNTIF(W11,$AM$76)+COUNTIF(W11,$AM$77)+COUNTIF(W11,$AM$78)+COUNTIF(W11,$AM$79)+COUNTIF(W11,$AM$80)+COUNTIF(W11,$AM$81))=0,\"\",COUNTIF(W11,$AM$71)+COUNTIF(W11,$AM$72)+COUNTIF(W11,$AM$73)+COUNTIF(W11,$AM$74)+COUNTIF(W11,$AM$75)+COUNTIF(W11,$AM$76)+COUNTIF(W11,$AM$77)+COUNTIF(W11,$AM$78)+COUNTIF(W11,$AM$79)+COUNTIF(W11,$AM$80)+COUNTIF(W11,$AM$81))","v":""},"","","","","","","","","","","","","","",null,"Recup"]
[null,null,null,null,null,null,null,null,null,null,null,null,null,null,"Jeudi",0,"",null,null,null,null,"Jeudi",{"$f":"IF((COUNTIF(W12,$AM$71)+COUNTIF(W12,$AM$72)+COUNTIF(W12,$AM$73)+COUNTIF(W12,$AM$74)+COUNTIF(W12,$AM$75)+COUNTIF(W12,$AM$76)+COUNTIF(W12,$AM$77)+COUNTIF(W12,$AM$78)+COUNTIF(W12,$AM$79)+COUNTIF(W12,$AM$80)+COUNTIF(W12,$AM$81))=0,\"\",COUNTIF(W12,$AM$71)+COUNTIF(W12,$AM$72)+COUNTIF(W12,$AM$73)+COUNTIF(W12,$AM$74)+COUNTIF(W12,$AM$75)+COUNTIF(W12,$AM$76)+COUNTIF(W12,$AM$77)+COUNTIF(W12,$AM$78)+COUNTIF(W12,$AM$79)+COUNTIF(W12,$AM$80)+COUNTIF(W12,$AM$81))","v":""},"","","","","","","","","","","","","","",null,"Form"]
[null,null,null,null,null,null,null,null,null,null,null,null,null,null,"Vendredi",0,"",null,null,null,null,"Vendredi",{"$f":"IF((COUNTIF(W13,$AM$71)+COUNTIF(W13,$AM$72)+COUNTIF(W13,$AM$73)+COUNTIF(W13,$AM$74)+COUNTIF(W13,$AM$75)+COUNTIF(W13,$AM$76)+COUNTIF(W13,$AM$77)+COUNTIF(W13,$AM$78)+COUNTIF(W13,$AM$79)+COUNTIF(W13,$AM$80)+COUNTIF(W13,$AM$81))=0,\"\",COUNTIF(W13,$AM$71)+COUNTIF(W13,$AM$72)+COUNTIF(W13,$AM$73)+COUNTIF(W13,$AM$74)+COUNTIF(W13,$AM$75)+COUNTIF(W13,$AM$76)+COUNTIF(W13,$AM$77)+COUNTIF(W13,$AM$78)+COUNTIF(W13,$AM$79)+COUNTIF(W13,$AM$80)+COUNTIF(W13,$AM$81))","v":""},"","","","","","","","","","","","","","",null,"Modul"]
[null,null,null,null,null,null,null,null,null,null,null,null,null,null,"Samedi",0,"",null,null,null,null,"Samedi",{"$f":"IF((COUNTIF(W14,$AM$71)+COUNTIF(W14,$AM$72)+COUNTIF(W14,$AM$73)+COUNTIF(W14,$AM$74)+COUNTIF(W14,$AM$75)+COUNTIF(W14,$AM$76)+COUNTIF(W14,$AM$77)+COUNTIF(W14,$AM$78)+COUNTIF(W14,$AM$79)+COUNTIF(W14,$AM$80)+COUNTIF(W14,$AM$81))=0,\"\",COUNTIF(W14,$AM$71)+COUNTIF(W14,$AM$72)+COUNTIF(W14,$AM$73)+COUNTIF(W14,$AM$74)+COUNTIF(W14,$AM$75)+COUNTIF(W14,$AM$76)+COUNTIF(W14,$AM$77)+COUNTIF(W14,$AM$78)+COUNTIF(W14,$AM$79)+COUNTIF(W14,$AM$80)+COUNTIF(W14,$AM$81))","v":""},"","","","","","","","","","","","","","",null,"H.R"]
[null,null,null,null,null,null,null,null,null,null,null,null,null,null,"Dimanche",0,"",null,null,null,null,"Dimanche",{"$f":"IF((COUNTIF(W15,$AM$71)+COUNTIF(W15,$AM$72)+COUNTIF(W15,$AM$73)+COUNTIF(W15,$AM$74)+COUNTIF(W15,$AM$75)+COUNTIF(W15,$AM$76)+COUNTIF(W15,$AM$77)+COUNTIF(W15,$AM$78)+COUNTIF(W15,$AM$79)+COUNTIF(W15,$AM$80)+COUNTIF(W15,$AM$81))=0,\"\",COUNTIF(W15,$AM$71)+COUNTIF(W15,$AM$72)+COUNTIF(W15,$AM$73)+COUNTIF(W15,$AM$74)+COUNTIF(W15,$AM$75)+COUNTIF(W15,$AM$76)+COUNTIF(W15,$AM$77)+COUNTIF(W15,$AM$78)+COUNTIF(W15,$AM$79)+COUNTIF(W15,$AM$80)+COUNTIF(W15,$AM$81))","v":""},"","","","","","","","","","","","","","",null,"HR Nuit"]
[null,null,null,null,null,null,null,null,null,null,null,null,null,null,"Lundi",0,"",null,null,null,null,"Lundi",{"$f":"IF((COUNTIF(W16,$AM$71)+COUNTIF(W16,$AM$72)+COUNTIF(W16,$AM$73)+COUNTIF(W16,$AM$74)+COUNTIF(W16,$AM$75)+COUNTIF(W16,$AM$76)+COUNTIF(W16,$AM$77)+COUNTIF(W16,$AM$78)+COUNTIF(W16,$AM$79)+COUNTIF(W16,$AM$80)+COUNTIF(W16,$AM$81))=0,\"\",COUNTIF(W16,$AM$71)+COUNTIF(W16,$AM$72)+COUNTIF(W16,$AM$73)+COUNTIF(W16,$AM$74)+COUNTIF(W16,$AM$75)+COUNTIF(W16,$AM$76)+COUNTIF(W16,$AM$77)+COUNTIF(W16,$AM$78)+COUNTIF(W16,$AM$79)+COUNTIF(W16,$AM$80)+COUNTIF(W16,$AM$81))","v":""},"","","","","","","","","","","","","","",null,"RTT"]
[null,null,null,null,null,null,null,null,null,null,null,null,null,null,null,null,null,null,null,null,null,null,null,null,null,null,null,null,null,null,null,null,null,null,null,null,null,null,"Malade"]
[null,null,null,null,null,null,null,null,null,null,null,null,null,null,null,null,null,null,null,null,null,null,null,null,null,null,null,null,null,null,null,null,null,null,null,null,null,null,"Mal"]
[null,null,null,null,null,null,null,null,null,null,null,null,null,null,null,null,null,null,null,null,null,null,null,null,null,null,null,null,null,null,null,null,null,null,null,null,null,null,"J.A"]
[null,null,null,null,null,null,null,null,null,null,null,null,null,null,null,null,null,null,null,null,null,null,null,null,null,null,null,null,null,null,null,null,null,null,null,null,null,null,"Ecole"]

{"sheet":"Abattoir","index":4,"n_rows":83,"n_cols":56,"rows_kept":83,"cut":false,"hidden":false,"merged":[[57,19,60,19],[67,17,67,18],[64,19,67,19],[9,1,12,2],[11,6,12,11],[7,6,8,7],[7,8,8,8],[7,9,8,10],[7,11,8,11],[17,6,18,7],[17,8,18,8],[19,6,19,7],[17,9,18,10],[20,1,22,2],[26,1,31,2],[31,4,31,11],[22,9,22,10],[25,9,25,10],[13,1,16,2],[17,1,19,2],[34,17,35,18],[39,19,42,19],[42,17,42,18],[48,17,48,18],[19,41,20,41],[26,4,26,11],[27,4,27,11],[28,4,28,11],[29,4,29,11],[5,6,6,7],[5,8,6,8],[5,9,6,10],[5,11,6,11],[13,6,14,7],[13,8,14,8],[15,6,16,7],[15,8,16,8],[15,9,16,10],[13,9,14,10],[15,11,16,11],[13,11,14,11],[3,22,8,22],[3,3,4,5],[3,31,8,31],[3,32,8,32],[3,33,8,33],[3,34,8,34],[3,35,8,35],[3,1,4,2],[4,9,4,11],[5,1,8,2],[9,6,10,11],[30,4,30,11],[22,6,22,7],[20,6,21,7],[25,6,25,7],[20,8,21,8],[20,9,21,10],[20,11,21,11],[23,6,24,7],[23,8,24,8],[23,9,24,10],[23,11,24,11],[17,11,18,11],[19,9,19,10],[23,1,25,2],[5,5,8,5],[9,5,12,5],[13,5,16,5],[17,5,19,5],[20,5,22,5],[23,5,25,5],[77,16,77,18],[78,16,78,18],[79,16,79,18],[51,17,51,18],[74,16,74,18],[75,16,75,18],[76,16,76,18],[64,17,64,18],[39,17,39,18],[60,17,60,18],[72,16,72,18],[73,16,73,18],[65,17,65,18],[66,17,66,18],[52,17,52,18],[53,17,53,18],[57,17,57,18],[58,17,58,18],[59,17,59,18],[40,17,40,18],[41,17,41,18],[45,17,45,18],[46,17,46,18],[47,17,47,18],[45,19,48,19],[54,17,54,18],[51,19,54,19],[36,19,37,19],[37,17,37,18],[36,17,36,18],[3,23,8,23],[3,24,8,24],[4,6,4,8],[5,3,8,4],[9,3,12,4],[13,3,16,4],[17,3,19,4],[20,3,22,4],[23,3,25,4],[3,36,8,36],[3,25,8,25],[3,26,8,26],[3,27,8,27],[3,28,8,28],[3,29,8,29],[3,30,8,30],[3,6,3,7],[3,9,3,10]]}
[]
[null,{"$f":"CONCATENATE(\"Du \",Q12,\"/\",R12,\"/\",S12,\" au \",Q13,\"/\",R13,\"/\",S13)","v":"Du 21/10/2019 au 27/10/2019"},null,null,null,null,null,null,"Semaine",42,{"$f":"Planning_général!C2","v":2019}]
[]
[null,"Équipes",null,"Horaires",null,null,"Nom et Prénom",null,"Matricule","Nom et Prénom",null,"Matricule",null,null,null,null,null,null,null,null,null,null,{"$f":"IF(Planning_général!$E32=0,\"\",Planning_général!$E32)","v":"Resp Equipe 2"},{"$f":"IF(Planning_général!$E33=0,\"\",Planning_général!$E33)","v":"Equipe 2_Tech 1"},{"$f":"IF(Planning_général!$E34=0,\"\",Planning_général!$E34)","v":"Equipe 2_Tech 2"},{"$f":"IF(Planning_général!$E35=0,\"\",Planning_général!$E35)","v":"Equipe 2_Tech 3"},{"$f":"IF(Planning_général!$E36=0,\"\",Planning_général!$E36)","v":"Equipe 2_Tech 4"},{"$f":"IF(Planning_général!$E37=0,\"\",Planning_général!$E37)","v":"Equipe 2_Tech 5"},{"$f":"IF(Planning_général!$E38=0,\"\",Planning_général!$E38)","v":"Equipe 2_Tech 6"},{"$f":"IF(Planning_général!$E39=0,\"\",Planning_général!$E39)","v":"Equipe 2_Tech 7"},{"$f":"IF(Planning_général!#REF!=0,\"\",Planning_général!#REF!)","v":{"$error":"#REF!"}},{"$f":"IF(Planning_général!$E41=0,\"\",Planning_général!$E41)","v":"Equipe 2_Tech 9"},{"$f":"IF(Planning_général!$E42=0,\"\",Planning_général!$E42)","v":"Equipe 2_Tech 10"},{"$f":"IF(Planning_général!$E43=0,\"\",Planning_général!$E43)","v":"Equipe 2_Tech 11"},{"$f":"IF(Planning_général!$E44=0,\"\",Planning_général!$E44)","v":"Equipe 2_Tech 12"},{"$f":"IF(Planning_général!$E40=0,\"\",Planning_général!$E40)","v":"Equipe 2_Tech 8"},{"$f":"IF(Planning_général!$E46=0,\"\",Planning_général!$E46)","v":""}]
[null,null,null,null,null,null,"Secteur Abattoir: 6114",null,null,"Secteur Découpe: 6167"]
[null,"Matin",null,"5 h 30 - 12 h 00 \nsauf le lundi 3 h 00 -12 h 00",null,"Pause \nLun. 9 h 00 à 9 h 30 \nSemaine de 9 h 00 à 9 h 20",{"$f":"IF(R40=\"\",\"\",R40)","v":""},null,{"$f":"IF(ISERROR(VLOOKUP(G6,Planning_général!$E$32:$F$46,2,0)),\"\",VLOOKUP(G6,Planning_général!$E$32:$F$46,2,0))","v":""},{"$f":"IF(R42=\"\",\"\",R42)","v":""},null,{"$f":"IF(ISERROR(VLOOKUP(J6,Planning_général!$E$32:$F$46,2,0)),\"\",VLOOKUP(J6,Planning_général!$E$32:$F$46,2,0))","v":""},null,null,null,"Initial",{"$f":"DATE(K2,1,1)","v":"2019-01-01"},{"$f":"Q6","v":43466}]
[null,null,null,null,null,null,null,null,null,null,null,null,null,null,null,"Du",{"$f":"(R6)+($J$2)*7-WEEKDAY(Q6,2)+1","v":"2019-10-21"},null,null,null,null,null,null,null,null,null,null,null,null,null,null,null,null,null,null,null,null,null,null,null,null,null,null,null,null,null,null,null,null,null,null,null,null,null,null,"Semaines"]
[null,null,null,null,null,null,{"$f":"IF(R41=\"\",\"\",R41)","v":""},null,{"$f":"IF(ISERROR(VLOOKUP(G8,Planning_général!$E$32:$F$46,2,0)),\"\",VLOOKUP(G8,Planning_général!$E$32:$F$46,2,0))","v":""},{"$f":"IF(R43=\"\",\"\",R43)","v":""},null,{"$f":"IF(ISERROR(VLOOKUP(J8,Planning_général!$E$32:$F$46,2,0)),\"\",VLOOKUP(J8,Planning_général!$E$32:$F$46,2,0))","v":""},null,null,null,"Au",{"$f":"Q7+6","v":"2019-10-27"},null,null,null,null,null,null,null,null,null,null,null,null,null,null,null,null,null,null,null,null,null,null,null,null,null,null,null,null,null,null,null,null,null,null,null,null,null,null,1]
[null,null,null,null,null,null,null,null,null,null,null,null,null,null,null,null,null,null,null,null,null,null,null,null,null,null,null,null,null,null,null,null,null,null,null,null,null,null,null,null,null,null,null,null,null,"Code",null,null,null,null,null,null,null,null,null,2]
[null,"Journée",null,"7h 00 - 14 h 00 ",null,"Pause de 12 h  00 à 12 h 20",{"$f":"IF(R37=\"\",\"\",CONCATENATE(R37,    \"    ( \", Q37, \" )\"))","v":""},null,null,null,null,null,null,null,null,null,null,null,null,null,null,"Code",{"$f":"IF(VLOOKUP(W4,Planning_général!$E$17:$F$62,2,0)=0,\"Cde abs\",VLOOKUP(W4,Planning_général!$E$17:$F$62,2,0))","v":5390},{"$f":"IF(VLOOKUP(X4,Planning_général!$E$17:$F$62,2,0)=0,\"Cde abs\",VLOOKUP(X4,Planning_général!$E$17:$F$62,2,0))","v":2908},{"$f":"IF(VLOOKUP(Y4,Planning_général!$E$17:$F$62,2,0)=0,\"Cde abs\",VLOOKUP(Y4,Planning_général!$E$17:$F$62,2,0))","v":3553},{"$f":"IF(VLOOKUP(Z4,Planning_général!$E$17:$F$62,2,0)=0,\"Cde abs\",VLOOKUP(Z4,Planning_général!$E$17:$F$62,2,0))","v":3737},{"$f":"IF(VLOOKUP(AA4,Planning_général!$E$17:$F$62,2,0)=0,\"Cde abs\",VLOOKUP(AA4,Planning_général!$E$17:$F$62,2,0))","v":3546},{"$f":"IF(VLOOKUP(AB4,Planning_général!$E$17:$F$62,2,0)=0,\"Cde abs\",VLOOKUP(AB4,Planning_général!$E$17:$F$62,2,0))","v":6742},{"$f":"IF(VLOOKUP(AC4,Planning_général!$E$17:$F$62,2,0)=0,\"Cde abs\",VLOOKUP(AC4,Planning_général!$E$17:$F$62,2,0))","v":1136},{"$f":"IF(VLOOKUP(AD4,Planning_général!$E$17:$F$62,2,0)=0,\"Cde abs\",VLOOKUP(AD4,Planning_général!$E$17:$F$62,2,0))","v":1410},{"$f":"IF(VLOOKUP(AE4,Planning_général!$E$17:$F$62,2,0)=0,\"Cde abs\",VLOOKUP(AE4,Planning_général!$E$17:$F$62,2,0))","v":{"$error":"#REF!"}},{"$f":"IF(VLOOKUP(AF4,Planning_général!$E$17:$F$62,2,0)=0,\"Cde abs\",VLOOKUP(AF4,Planning_général!$E$17:$F$62,2,0))","v":5885},{"$f":"IF(VLOOKUP(AG4,Planning_général!$E$17:$F$62,2,0)=0,\"Cde abs\",VLOOKUP(AG4,Planning_général!$E$17:$F$62,2,0))","v":9353},{"$f":"IF(VLOOKUP(AH4,Planning_général!$E$17:$F$62,2,0)=0,\"Cde abs\",VLOOKUP(AH4,Planning_général!$E$17:$F$62,2,0))","v":6746},{"$f":"IF(VLOOKUP(AI4,Planning_général!$E$17:$F$62,2,0)=0,\"Cde abs\",VLOOKUP(AI4,Planning_général!$E$17:$F$62,2,0))","v":9600},{"$f":"IF(VLOOKUP(AJ4,Planning_général!$E$17:$F$62,2,0)=0,\"Cde abs\",VLOOKUP(AJ4,Planning_général!$E$17:$F$62,2,0))","v":7202},{"$f":"IF(AK4=0,\"\",IF(VLOOKUP(AK4,Planning_général!$E$17:$F$62,2,0)=0,\"Cde abs\",VLOOKUP(AK4,Planning_général!$E$17:$F$62,2,0)))","v":{"$error":"#N/A"}},null,null,null,"Code","Descriptif","Horaires","Pause",null,"                       ",null,null,null,null,null,null,null,null,null,3]
[null,null,null,null,null,null,null,null,null,null,null,null,null,null,null,null,null,null,null,null,{"$f":"Planning_général!G10","v":"M"},{"$f":"VLOOKUP(U11,Planning_général!$NV$20:$NW$26,2,0)","v":"Mardi"},{"$f":"VLOOKUP(W4,Planning_général!$E$32:$NM$32,((($J$2*7)+2)-6),0)","v":0},{"$f":"IF(ISNA(VLOOKUP(X4,Planning_général!$E$33:$NM$33,((($J$2*7)+2)-6),0)),0,VLOOKUP(X4,Planning_général!$E$33:$NM$33,((($J$2*7)+2)-6),0))","v":0},{"$f":"VLOOKUP(Y4,Planning_général!$E$34:$NM$34,((($J$2*7)+2)-6),0)","v":0},{"$f":"VLOOKUP(Z4,Planning_général!$E$35:$NM$35,((($J$2*7)+2)-6),0)","v":0},{"$f":"VLOOKUP(AA4,Planning_général!$E$36:$NM$36,((($J$2*7)+2)-6),0)","v":0},{"$f":"VLOOKUP(AB4,Planning_général!$E$37:$NM$37,((($J$2*7)+2)-6),0)","v":0},{"$f":"VLOOKUP($AC$4,Planning_général!$E$38:$NM$38,((($J$2*7)+2)-6),0)","v":0},{"$f":"VLOOKUP($AD$4,Planning_général!$E$39:$NM$39,((($J$2*7)+2)-6),0)","v":0},{"$f":"VLOOKUP($AE$4,Planning_général!#REF!,((($J$2*7)+2)-6),0)","v":{"$error":"#REF!"}},{"$f":"VLOOKUP($AF$4,Planning_général!$E$41:$NM$41,((($J$2*7)+2)-6),0)","v":0},{"$f":"VLOOKUP($AG$4,Planning_général!$E$42:$NM$42,((($J$2*7)+2)-6),0)","v":0},{"$f":"VLOOKUP($AH$4,Planning_général!$E$43:$NM$43,((($J$2*7)+2)-6),0)","v":0},{"$f":"VLOOKUP($AI$4,Planning_général!$E$44:$NM$44,((($J$2*7)+2)-6),0)","v":0},{"$f":"VLOOKUP($AJ$4,Planning_général!$E$40:$NM$40,((($J$2*7)+2)-6),0)","v":0},{"$f":"IF(ISNA(VLOOKUP($AK$4,Planning_général!$E$46:$NM$46,((($J$2*7)+2)-6),0)),0,VLOOKUP($AK$4,Planning_général!$E$46:$NM$46,((($J$2*7)+2)-6),0))","v":0},null,null,null,"M.A","Matin Aba","5 h 30 - 12 h 30 ","9 h - 9 h 30",null,"Recup",null,null,null,null,null,null,null,null,null,4]
[null,null,null,null,null,null,{"$f":"IF(R38=\"\",\"\",CONCATENATE(R38,    \"    ( \", Q38, \" )\"))","v":""},null,null,null,null,null,null,null,null,{"$f":"Q7","v":"2019-10-21"},{"$f":"DAY(P12)","v":21},{"$f":"MONTH(P12)","v":10},{"$f":"YEAR(P12)","v":2019},null,{"$f":"Planning_général!H10","v":"Me"},{"$f":"VLOOKUP(U12,Planning_général!$NV$20:$NW$26,2,0)","v":"Mercredi"},{"$f":"VLOOKUP($W$4,Planning_général!$E$32:$NM$32,((($J$2*7)+2)-5),0)","v":0},{"$f":"VLOOKUP($X$4,Planning_général!$E$33:$NM$33,((($J$2*7)+2)-5),0)","v":0},{"$f":"VLOOKUP($Y$4,Planning_général!$E$34:$NM$34,((($J$2*7)+2)-5),0)","v":0},{"$f":"VLOOKUP($Z$4,Planning_général!$E$35:$NM$35,((($J$2*7)+2)-5),0)","v":0},{"$f":"VLOOKUP($AA$4,Planning_général!$E$36:$NM$36,((($J$2*7)+2)-5),0)","v":0},{"$f":"VLOOKUP($AB$4,Planning_général!$E$37:$NM$37,((($J$2*7)+2)-5),0)","v":0},{"$f":"VLOOKUP($AC$4,Planning_général!$E$38:$NM$38,((($J$2*7)+2)-5),0)","v":0},{"$f":"VLOOKUP($AD$4,Planning_général!$E$39:$NM$39,((($J$2*7)+2)-5),0)","v":0},{"$f":"VLOOKUP($AE$4,Planning_général!#REF!,((($J$2*7)+2)-5),0)","v":{"$error":"#REF!"}},{"$f":"VLOOKUP($AF$4,Planning_général!$E$41:$NM$41,((($J$2*7)+2)-5),0)","v":0},{"$f":"VLOOKUP($AG$4,Planning_général!$E$42:$NM$42,((($J$2*7)+2)-5),0)","v":0},{"$f":"VLOOKUP($AH$4,Planning_général!$E$43:$NM$43,((($J$2*7)+2)-5),0)","v":0},{"$f":"VLOOKUP($AI$4,Planning_général!$E$44:$NM$44,((($J$2*7)+2)-5),0)","v":0},{"$f":"VLOOKUP($AJ$4,Planning_général!$E$40:$NM$40,((($J$2*7)+2)-5),0)","v":0},{"$f":"IF(ISNA(VLOOKUP($AK$4,Planning_général!$E$46:$NM$46,((($J$2*7)+2)-5),0)),0,VLOOKUP($AK$4,Planning_général!$E$46:$NM$46,((($J$2*7)+2)-5),0))","v":0},null,null,null,"M.D","Matin Déc","5 h 30 - 12 h 30 ","9 h 20 - 9 h 20",null,"Form",null,null,null,null,null,null,null,null,null,5]
[null,null,null,null,null,null,null,null,null,null,null,null,null,null,null,{"$f":"Q8","v":"2019-10-27"},{"$f":"DAY(P13)","v":27},{"$f":"MONTH(P13)","v":10},{"$f":"YEAR(P13)","v":2019},null,{"$f":"Planning_général!I10","v":"J"},{"$f":"VLOOKUP(U13,Planning_général!$NV$20:$NW$26,2,0)","v":"Jeudi"},{"$f":"VLOOKUP($W$4,Planning_général!$E$32:$NM$32,((($J$2*7)+2)-4),0)","v":0},{"$f":"VLOOKUP($X$4,Planning_général!$E$33:$NM$33,((($J$2*7)+2)-4),0)","v":0},{"$f":"VLOOKUP($Y$4,Planning_général!$E$34:$NM$34,((($J$2*7)+2)-4),0)","v":0},{"$f":"VLOOKUP($Z$4,Planning_général!$E$35:$NM$35,((($J$2*7)+2)-4),0)","v":0},{"$f":"VLOOKUP($AA$4,Planning_général!$E$36:$NM$36,((($J$2*7)+2)-4),0)","v":0},{"$f":"VLOOKUP($AB$4,Planning_général!$E$37:$NM$37,((($J$2*7)+2)-4),0)","v":0},{"$f":"VLOOKUP($AC$4,Planning_général!$E$38:$NM$38,((($J$2*7)+2)-4),0)","v":0},{"$f":"VLOOKUP($AD$4,Planning_général!$E$39:$NM$39,((($J$2*7)+2)-4),0)","v":0},{"$f":"VLOOKUP($AE$4,Planning_général!#REF!,((($J$2*7)+2)-4),0)","v":{"$error":"#REF!"}},{"$f":"VLOOKUP($AF$4,Planning_général!$E$41:$NM$41,((($J$2*7)+2)-4),0)","v":0},{"$f":"VLOOKUP($AG$4,Planning_général!$E$42:$NM$42,((($J$2*7)+2)-4),0)","v":0},{"$f":"VLOOKUP($AH$4,Planning_général!$E$43:$NM$43,((($J$2*7)+2)-4),0)","v":0},{"$f":"VLOOKUP($AI$4,Planning_général!$E$44:$NM$44,((($J$2*7)+2)-4),0)","v":0},{"$f":"VLOOKUP($AJ$4,Planning_général!$E$40:$NM$40,((($J$2*7)+2)-4),0)","v":0},{"$f":"IF(ISNA(VLOOKUP($AK$4,Planning_général!$E$46:$NM$46,((($J$2*7)+2)-4),0)),0,VLOOKUP($AK$4,Planning_général!$E$46:$NM$46,((($J$2*7)+2)-4),0))","v":0},null,null,null,"AM.A","AP Abat","11 h 30 - 18 h 30 ","15 h 00 - 15 h 20",null,"Modul",null,null,null,null,null,null,null,null,null,6]
[null,"Après-midi",null,"11 h 30 -18 h 30",null,"Pause de 15 h 00 à 15 h 20",{"$f":"IF(R46=\"\",\"\",R46)","v":""},null,{"$f":"IF(ISERROR(VLOOKUP(G14,Planning_général!$E$32:$F$46,2,0)),\"\",VLOOKUP(G14,Planning_général!$E$32:$F$46,2,0))","v":""},{"$f":"IF(R48=\"\",\"\",R48)","v":""},null,{"$f":"IF(ISERROR(VLOOKUP(J14,Planning_général!$E$32:$F$46,2,0)),\"\",VLOOKUP(J14,Planning_général!$E$32:$F$46,2,0))","v":""},null,null,null,null,null,null,null,null,{"$f":"Planning_général!J10","v":"V"},{"$f":"VLOOKUP(U14,Planning_général!$NV$20:$NW$26,2,0)","v":"Vendredi"},{"$f":"VLOOKUP($W$4,Planning_général!$E$32:$NM$32,((($J$2*7)+2)-3),0)","v":0},{"$f":"VLOOKUP($X$4,Planning_général!$E$33:$NM$33,((($J$2*7)+2)-3),0)","v":0},{"$f":"VLOOKUP($Y$4,Planning_général!$E$34:$NM$34,((($J$2*7)+2)-3),0)","v":0},{"$f":"VLOOKUP($Z$4,Planning_général!$E$35:$NM$35,((($J$2*7)+2)-3),0)","v":0},{"$f":"VLOOKUP($AA$4,Planning_général!$E$36:$NM$36,((($J$2*7)+2)-3),0)","v":0},{"$f":"VLOOKUP($AB$4,Planning_général!$E$37:$NM$37,((($J$2*7)+2)-3),0)","v":0},{"$f":"VLOOKUP($AC$4,Planning_général!$E$38:$NM$38,((($J$2*7)+2)-3),0)","v":0},{"$f":"VLOOKUP($AD$4,Planning_général!$E$39:$NM$39,((($J$2*7)+2)-3),0)","v":0},{"$f":"VLOOKUP($AE$4,Planning_général!#REF!,((($J$2*7)+2)-3),0)","v":{"$error":"#REF!"}},{"$f":"VLOOKUP($AF$4,Planning_général!$E$41:$NM$41,((($J$2*7)+2)-3),0)","v":0},{"$f":"VLOOKUP($AG$4,Planning_général!$E$42:$NM$42,((($J$2*7)+2)-3),0)","v":0},{"$f":"VLOOKUP($AH$4,Planning_général!$E$43:$NM$43,((($J$2*7)+2)-3),0)","v":0},{"$f":"VLOOKUP($AI$4,Planning_général!$E$44:$NM$44,((($J$2*7)+2)-3),0)","v":0},{"$f":"VLOOKUP($AJ$4,Planning_général!$E$40:$NM$40,((($J$2*7)+2)-3),0)","v":0},{"$f":"IF(ISNA(VLOOKUP($AK$4,Planning_général!$E$46:$NM$46,((($J$2*7)+2)-3),0)),0,VLOOKUP($AK$4,Planning_général!$E$46:$NM$46,((($J$2*7)+2)-3),0))","v":0},null,null,null,"AM.D","AP Decoupe","11 h 30 - 18 h 30 ","15 h 00 - 15 h 20",null,"H.R",null,null,null,null,null,null,null,null,null,7]
[null,null,null,null,null,null,null,null,null,null,null,null,null,null,null,null,null,null,null,null,{"$f":"Planning_général!K10","v":"S"},{"$f":"VLOOKUP(U15,Planning_général!$NV$20:$NW$26,2,0)","v":"Samedi"},{"$f":"VLOOKUP($W$4,Planning_général!$E$32:$NM$32,((($J$2*7)+2)-2),0)","v":0},{"$f":"VLOOKUP($X$4,Planning_général!$E$33:$NM$33,((($J$2*7)+2)-2),0)","v":0},{"$f":"VLOOKUP($Y$4,Planning_général!$E$34:$NM$34,((($J$2*7)+2)-2),0)","v":0},{"$f":"VLOOKUP($Z$4,Planning_général!$E$35:$NM$35,((($J$2*7)+2)-2),0)","v":0},{"$f":"VLOOKUP($AA$4,Planning_général!$E$36:$NM$36,((($J$2*7)+2)-2),0)","v":0},{"$f":"VLOOKUP($AB$4,Planning_général!$E$37:$NM$37,((($J$2*7)+2)-2),0)","v":0},{"$f":"VLOOKUP($AC$4,Planning_général!$E$38:$NM$38,((($J$2*7)+2)-2),0)","v":0},{"$f":"VLOOKUP($AD$4,Planning_général!$E$39:$NM$39,((($J$2*7)+2)-2),0)","v":0},{"$f":"VLOOKUP($AE$4,Planning_général!#REF!,((($J$2*7)+2)-2),0)","v":{"$error":"#REF!"}},{"$f":"VLOOKUP($AF$4,Planning_général!$E$41:$NM$41,((($J$2*7)+2)-2),0)","v":0},{"$f":"VLOOKUP($AG$4,Planning_général!$E$42:$NM$42,((($J$2*7)+2)-2),0)","v":0},{"$f":"VLOOKUP($AH$4,Planning_général!$E$43:$NM$43,((($J$2*7)+2)-2),0)","v":0},{"$f":"VLOOKUP($AI$4,Planning_général!$E$44:$NM$44,((($J$2*7)+2)-2),0)","v":0},{"$f":"VLOOKUP($AJ$4,Planning_général!$E$40:$NM$40,((($J$2*7)+2)-2),0)","v":0},{"$f":"IF(ISNA(VLOOKUP($AK$4,Planning_général!$E$46:$NM$46,((($J$2*7)+2)-2),0)),0,VLOOKUP($AK$4,Planning_général!$E$46:$NM$46,((($J$2*7)+2)-2),0))","v":0},null,null,null,"N.A","Nuit abat","23 h 00 - 06 h 00 ","2 h 00 - 02 h 20",null,"HR Nuit",null,null,null,null,null,null,null,null,null,8]
[null,null,null,null,null,null,{"$f":"IF(R47=\"\",\"\",R47)","v":""},null,{"$f":"IF(ISERROR(VLOOKUP(G16,Planning_général!$E$32:$F$46,2,0)),\"\",VLOOKUP(G16,Planning_général!$E$32:$F$46,2,0))","v":""},{"$f":"IF(R49=\"\",\"\",R49)","v":""},null,{"$f":"IF(ISERROR(VLOOKUP(J16,Planning_général!$E$32:$F$46,2,0)),\"\",VLOOKUP(J16,Planning_général!$E$32:$F$46,2,0))","v":""},null,null,null,null,null,null,null,null,{"$f":"Planning_général!L10","v":"D"},{"$f":"VLOOKUP(U16,Planning_général!$NV$20:$NW$26,2,0)","v":"Dimanche"},{"$f":"VLOOKUP($W$4,Planning_général!$E$32:$NM$32,((($J$2*7)+2)-1),0)","v":0},{"$f":"VLOOKUP($X$4,Planning_général!$E$33:$NM$33,((($J$2*7)+2)-1),0)","v":0},{"$f":"VLOOKUP($Y$4,Planning_général!$E$34:$NM$34,((($J$2*7)+2)-1),0)","v":0},{"$f":"VLOOKUP($Z$4,Planning_général!$E$35:$NM$35,((($J$2*7)+2)-1),0)","v":0},{"$f":"VLOOKUP($AA$4,Planning_général!$E$36:$NM$36,((($J$2*7)+2)-1),0)","v":0},{"$f":"VLOOKUP($AB$4,Planning_général!$E$37:$NM$37,((($J$2*7)+2)-1),0)","v":0},{"$f":"VLOOKUP($AC$4,Planning_général!$E$38:$NM$38,((($J$2*7)+2)-1),0)","v":0},{"$f":"VLOOKUP($AD$4,Planning_général!$E$39:$NM$39,((($J$2*7)+2)-1),0)","v":0},{"$f":"VLOOKUP($AE$4,Planning_général!#REF!,((($J$2*7)+2)-1),0)","v":{"$error":"#REF!"}},{"$f":"VLOOKUP($AF$4,Planning_général!$E$41:$NM$41,((($J$2*7)+2)-1),0)","v":0},{"$f":"VLOOKUP($AG$4,Planning_général!$E$42:$NM$42,((($J$2*7)+2)-1),0)","v":0},{"$f":"VLOOKUP($AH$4,Planning_général!$E$43:$NM$43,((($J$2*7)+2)-1),0)","v":0},{"$f":"VLOOKUP($AI$4,Planning_général!$E$44:$NM$44,((($J$2*7)+2)-1),0)","v":0},{"$f":"VLOOKUP($AJ$4,Planning_général!$E$40:$NM$40,((($J$2*7)+2)-1),0)","v":0},{"$f":"IF(ISNA(VLOOKUP($AK$4,Planning_général!$E$46:$NM$46,((($J$2*7)+2)-1),0)),0,VLOOKUP($AK$4,Planning_général!$E$46:$NM$46,((($J$2*7)+2)-1),0))","v":0},null,null,null,"N.D","Nuit Decou","23 h 00 - 06 h 00 ","13 h 30 - 15 h 50",null,"RTT",null,null,null,null,null,null,null,null,null,9]
[null,null,null,null,null,null,null,null,null,null,null,null,null,null,null,null,null,null,null,null,{"$f":"Planning_général!M10","v":"L"},{"$f":"VLOOKUP(U17,Planning_général!$NV$20:$NW$26,2,0)","v":"Lundi"},{"$f":"VLOOKUP($W$4,Planning_général!$E$32:$NM$32,((($J$2*7)+2)-0),0)","v":0},{"$f":"VLOOKUP($X$4,Planning_général!$E$33:$NM$33,((($J$2*7)+2)-0),0)","v":0},{"$f":"VLOOKUP($Y$4,Planning_général!$E$34:$NM$34,((($J$2*7)+2)-0),0)","v":0},{"$f":"VLOOKUP($Z$4,Planning_général!$E$35:$NM$35,((($J$2*7)+2)-0),0)","v":0},{"$f":"VLOOKUP($AA$4,Planning_général!$E$36:$NM$36,((($J$2*7)+2)-0),0)","v":0},{"$f":"VLOOKUP($AB$4,Planning_général!$E$37:$NM$37,((($J$2*7)+2)-0),0)","v":0},{"$f":"VLOOKUP($AC$4,Planning_général!$E$38:$NM$38,((($J$2*7)+2)-0),0)","v":0},{"$f":"VLOOKUP($AD$4,Planning_général!$E$39:$NM$39,((($J$2*7)+2)-0),0)","v":0},{"$f":"VLOOKUP($AE$4,Planning_général!#REF!,((($J$2*7)+2)-0),0)","v":{"$error":"#REF!"}},{"$f":"VLOOKUP($AF$4,Planning_général!$E$41:$NM$41,((($J$2*7)+2)-0),0)","v":0},{"$f":"VLOOKUP($AG$4,Planning_général!$E$42:$NM$42,((($J$2*7)+2)-0),0)","v":0},{"$f":"VLOOKUP($AH$4,Planning_général!$E$43:$NM$43,((($J$2*7)+2)-0),0)","v":0},{"$f":"VLOOKUP($AI$4,Planning_général!$E$44:$NM$44,((($J$2*7)+2)-0),0)","v":0},{"$f":"VLOOKUP($AJ$4,Planning_général!$E$40:$NM$40,((($J$2*7)+2)-0),0)","v":0},{"$f":"IF(ISNA(VLOOKUP($AK$4,Planning_général!$E$46:$NM$46,((($J$2*7)+2)-0),0)),0,VLOOKUP($AK$4,Planning_général!$E$46:$NM$46,((($J$2*7)+2)-0),0))","v":0},null,null,null,"J","Journée","07 h 00 - 14 h 00 ","12 h 00 - 12 h 30",null,"Mal",null,null,null,null,null,null,null,null,null,10]
[null,"SOIR",null,"18 h 00 - 01 h 00",null,"Pause de 22 h 00 à 22 h 20",{"$f":"IF(R52=\"\",\"\",R52)","v":""},null,{"$f":"IF(ISERROR(VLOOKUP(G18,Planning_général!$E$32:$F$46,2,0)),\"\",VLOOKUP(G18,Planning_général!$E$32:$F$46,2,0))","v":""},{"$f":"IF(R54=\"\",\"\",R54)","v":""},null,{"$f":"IF(ISERROR(VLOOKUP(J18,Planning_général!$E$32:$F$46,2,0)),\"\",VLOOKUP(J18,Planning_général!$E$32:$F$46,2,0))","v":""},null,null,null,null,null,null,null,null,null,null,null,null,null,null,null,null,null,null,null,null,null,null,null,null,null,null,null,null,"S.A","Nuit abat","18 h 00 - 01 h 00","22 h 00 - 22 h 20",null,"J.A",null,null,null,null,null,null,null,null,null,11]
[null,null,null,null,null,null,null,null,null,null,null,null,null,null,null,null,null,null,null,null,null,null,null,null,null,null,null,null,null,null,null,null,null,null,null,null,null,null,null,null,"S.D","Nuit Décou","18 h 00 - 01 h 00","22 h 00 - 22 h 20",null,"Ecole",null,null,null,null,null,null,null,null,null,12]
[null,null,null,null,null,null,{"$f":"IF(R53=\"\",\"\",R53)","v":""},null,{"$f":"IF(ISERROR(VLOOKUP(G20,Planning_général!$E$32:$F$46,2,0)),\"\",VLOOKUP(G20,Planning_général!$E$32:$F$46,2,0))","v":""},{"$f":"IF(R55=\"\",\"\",R55)","v":""},null,{"$f":"IF(ISERROR(VLOOKUP(J20,Planning_général!$E$32:$F$46,2,0)),\"\",VLOOKUP(J20,Planning_général!$E$32:$F$46,2,0))","v":""},null,null,null,null,null,null,null,null,null,null,null,null,null,null,null,null,null,null,null,null,null,null,null,null,null,null,null,null,"SM.A","Samedi","6 h 00 - 13 h 00 ","9 h 20 - 9 h 20",null,"Dep  ",null,null,null,null,null,null,null,null,null,13]
[null,"Nuit",null,"23 h 00 - 06 h 00",null,"Pause de 02 h 00 à 02 h 20",{"$f":"IF(R58=\"\",\"\",R58)","v":""},null,{"$f":"IF(ISERROR(VLOOKUP(G21,Planning_général!$E$32:$F$46,2,0)),\"\",VLOOKUP(G21,Planning_général!$E$32:$F$46,2,0))","v":""},{"$f":"IF(R60=\"\",\"\",R60)","v":""},null,{"$f":"IF(ISERROR(VLOOKUP(J21,Planning_général!$E$32:$F$46,2,0)),\"\",VLOOKUP(J21,Planning_général!$E$32:$F$46,2,0))","v":""},null,null,null,null,null,null,null,null,null,{"$f":"AO11","v":"M.A"},{"$f":"IF(COUNTIF($W$11:$W$17,V21)=0,\"\",COUNTIF($W$11:$W$17,V21))","v":""},{"$f":"IF(COUNTIF($X$11:$X$17,V21)=0,\"\",COUNTIF($X$11:$X$17,V21))","v":""},{"$f":"IF(COUNTIF($Y$11:$Y$17,V21)=0,\"\",COUNTIF($Y$11:$Y$17,V21))","v":""},{"$f":"IF(COUNTIF($Z$11:$Z$17,V21)=0,\"\",COUNTIF($Z$11:$Z$17,V21))","v":""},{"$f":"IF(COUNTIF($AA$11:$AA$17,V21)=0,\"\",COUNTIF($AA$11:$AA$17,V21))","v":""},{"$f":"IF(COUNTIF($AB$11:$AB$17,V21)=0,\"\",COUNTIF($AB$11:$AB$17,V21))","v":""},{"$f":"IF(COUNTIF($AC$11:$AC$17,V21)=0,\"\",COUNTIF($AC$11:$AC$17,V21))","v":""},{"$f":"IF(COUNTIF($AD$11:$AD$17,$V$21)=0,\"\",COUNTIF($AD$11:$AD$17,$V$21))","v":""},{"$f":"IF(COUNTIF($AE$11:$AE$17,$V$21)=0,\"\",COUNTIF($AE$11:$AE$17,$V$21))","v":""},{"$f":"IF(COUNTIF($AF$11:$AF$17,$V$21)=0,\"\",COUNTIF($AF$11:$AF$17,$V$21))","v":""},{"$f":"IF(COUNTIF($AG$11:$AG$17,$V$21)=0,\"\",COUNTIF($AG$11:$AG$17,$V$21))","v":""},{"$f":"IF(COUNTIF($AH$11:$AH$17,$V$21)=0,\"\",COUNTIF($AH$11:$AH$17,$V$21))","v":""},{"$f":"IF(COUNTIF($AI$11:$AI$17,$V$21)=0,\"\",COUNTIF($AI$11:$AI$17,$V$21))","v":""},{"$f":"IF(COUNTIF($AJ$11:$AJ$17,$V$21)=0,\"\",COUNTIF($AJ$11:$AJ$17,$V$21))","v":""},{"$f":"IF(COUNTIF($AK$11:$AK$17,$V$21)=0,\"\",COUNTIF($AK$11:$AK$17,$V$21))","v":""},null,null,null,"SM.D",null,"6 h 00 - 13 h 00 ","9 h 20 - 9 h 20",null,null,null,null,null,null,null,null,null,null,null,16]
[null,null,null,null,null,null,null,null,null,null,null,null,null,null,null,null,null,null,null,null,null,"M.D",{"$f":"IF(COUNTIF($W$11:$W$17,V22)=0,\"\",COUNTIF($W$11:$W$17,V22))","v":""},{"$f":"IF(COUNTIF($X$11:$X$17,V22)=0,\"\",COUNTIF($X$11:$X$17,V22))","v":""},{"$f":"IF(COUNTIF($Y$11:$Y$17,V22)=0,\"\",COUNTIF($Y$11:$Y$17,V22))","v":""},{"$f":"IF(COUNTIF($Z$11:$Z$17,V22)=0,\"\",COUNTIF($Z$11:$Z$17,V22))","v":""},{"$f":"IF(COUNTIF($AA$11:$AA$17,V22)=0,\"\",COUNTIF($AA$11:$AA$17,V22))","v":""},{"$f":"IF(COUNTIF($AB$11:$AB$17,V22)=0,\"\",COUNTIF($AB$11:$AB$17,V22))","v":""},{"$f":"IF(COUNTIF($AC$11:$AC$17,V22)=0,\"\",COUNTIF($AC$11:$AC$17,V22))","v":""},{"$f":"IF(COUNTIF($AD$11:$AD$17,$V$22)=0,\"\",COUNTIF($AD$11:$AD$17,$V$22))","v":""},{"$f":"IF(COUNTIF($AE$11:$AE$17,$V$22)=0,\"\",COUNTIF($AE$11:$AE$17,$V$22))","v":""},{"$f":"IF(COUNTIF($AF$11:$AF$17,$V$22)=0,\"\",COUNTIF($AF$11:$AF$17,$V$22))","v":""},{"$f":"IF(COUNTIF($AG$11:$AG$17,$V$22)=0,\"\",COUNTIF($AG$11:$AG$17,$V$22))","v":""},{"$f":"IF(COUNTIF($AH$11:$AH$17,$V$22)=0,\"\",COUNTIF($AH$11:$AH$17,$V$22))","v":""},{"$f":"IF(COUNTIF($AI$11:$AI$17,$V$22)=0,\"\",COUNTIF($AI$11:$AI$17,$V$22))","v":""},{"$f":"IF(COUNTIF($AJ$11:$AJ$17,$V$22)=0,\"\",COUNTIF($AJ$11:$AJ$17,$V$22))","v":""},{"$f":"IF(COUNTIF($AK$11:$AK$17,$V$22)=0,\"\",COUNTIF($AK$11:$AK$17,$V$22))","v":""},null,null,null,null,null,null,null,null,null,null,null,null,null,null,null,null,null,null,17]
[null,null,null,null,null,null,{"$f":"IF(R59=\"\",\"\",R59)","v":""},null,{"$f":"IF(ISERROR(VLOOKUP(G23,Planning_général!$E$32:$F$46,2,0)),\"\",VLOOKUP(G23,Planning_général!$E$32:$F$46,2,0))","v":""},{"$f":"IF(R61=\"\",\"\",R61)","v":""},null,{"$f":"IF(ISERROR(VLOOKUP(J23,Planning_général!$E$32:$F$46,2,0)),\"\",VLOOKUP(J23,Planning_général!$E$32:$F$46,2,0))","v":""},null,null,null,null,null,null,null,null,null,"AM.A",{"$f":"IF(COUNTIF($W$11:$W$17,V23)=0,\"\",COUNTIF($W$11:$W$17,V23))","v":""},"","","","","",{"$f":"IF(COUNTIF($AC$11:$AC$17,V23)=0,\"\",COUNTIF($AC$11:$AC$17,V23))","v":""},{"$f":"IF(COUNTIF($AD$11:$AD$17,V23)=0,\"\",COUNTIF($AD$11:$AD$17,V23))","v":""},{"$f":"IF(COUNTIF($AE$11:$AE$17,$V$23)=0,\"\",COUNTIF($AE$11:$AE$17,$V$23))","v":""},{"$f":"IF(COUNTIF($AF$11:$AF$17,$V$23)=0,\"\",COUNTIF($AF$11:$AF$17,$V$23))","v":""},{"$f":"IF(COUNTIF($AG$11:$AG$17,$V$23)=0,\"\",COUNTIF($AG$11:$AG$17,$V$23))","v":""},{"$f":"IF(COUNTIF($AH$11:$AH$17,$V$23)=0,\"\",COUNTIF($AH$11:$AH$17,$V$23))","v":""},{"$f":"IF(COUNTIF($AI$11:$AI$17,$V$23)=0,\"\",COUNTIF($AI$11:$AI$17,$V$23))","v":""},{"$f":"IF(COUNTIF($AJ$11:$AJ$17,$V$23)=0,\"\",COUNTIF($AJ$11:$AJ$17,$V$23))","v":""},{"$f":"IF(COUNTIF($AK$11:$AK$17,$V$23)=0,\"\",COUNTIF($AK$11:$AK$17,$V$23))","v":""},null,null,null,null,null,null,null,null,null,null,null,null,null,null,null,null,null,null,18]
[null,"SAMEDI",null,"06 h 00 - 13 h 00",null,"Pause de 09 h 00 à 09 h 20",{"$f":"R65","v":""},null,{"$f":"IF(ISERROR(VLOOKUP(G24,Planning_général!$E$32:$F$46,2,0)),\"\",VLOOKUP(G24,Planning_général!$E$32:$F$46,2,0))","v":""},{"$f":"R67","v":""},null,{"$f":"IF(ISERROR(VLOOKUP(J24,Planning_général!$E$32:$F$46,2,0)),\"\",VLOOKUP(J24,Planning_général!$E$32:$F$46,2,0))","v":""},null,null,null,null,null,null,null,null,null,"AM.D","","","","","","","",{"$f":"IF(COUNTIF($AD$11:$AD$17,$V$24)=0,\"\",COUNTIF($AD$11:$AD$17,$V$24))","v":""},{"$f":"IF(COUNTIF($AE$11:$AE$17,$V$24)=0,\"\",COUNTIF($AE$11:$AE$17,$V$24))","v":""},{"$f":"IF(COUNTIF($AF$11:$AF$17,$V$24)=0,\"\",COUNTIF($AF$11:$AF$17,$V$24))","v":""},{"$f":"IF(COUNTIF($AG$11:$AG$17,$V$24)=0,\"\",COUNTIF($AG$11:$AG$17,$V$24))","v":""},{"$f":"IF(COUNTIF($AH$11:$AH$17,$V$24)=0,\"\",COUNTIF($AH$11:$AH$17,$V$24))","v":""},{"$f":"IF(COUNTIF($AI$11:$AI$17,$V$24)=0,\"\",COUNTIF($AI$11:$AI$17,$V$24))","v":""},{"$f":"IF(COUNTIF($AJ$11:$AJ$17,$V$24)=0,\"\",COUNTIF($AJ$11:$AJ$17,$V$24))","v":""},{"$f":"IF(COUNTIF($AK$11:$AK$17,$V$24)=0,\"\",COUNTIF($AK$11:$AK$17,$V$24))","v":""},null,null,null,null,null,null,null,null,null,null,null,null,null,null,null,null,null,null,19]
[null,null,null,null,null,null,null,null,null,null,null,null,null,null,null,null,null,null,null,null,null,"N.A","","","","","","",{"$f":"IF(COUNTIF($AC$11:$AC$17,$V$25)=0,\"\",COUNTIF($AC$11:$AC$17,V25))","v":""},{"$f":"IF(COUNTIF($AD$11:$AD$17,$V$25)=0,\"\",COUNTIF($AD$11:$AD$17,$V$25))","v":""},{"$f":"IF(COUNTIF($AE$11:$AE$17,$V$25)=0,\"\",COUNTIF($AE$11:$AE$17,$V$25))","v":""},{"$f":"IF(COUNTIF($AF$11:$AF$17,$V$25)=0,\"\",COUNTIF($AF$11:$AF$17,$V$25))","v":""},{"$f":"IF(COUNTIF($AG$11:$AG$17,$V$25)=0,\"\",COUNTIF($AG$11:$AG$17,$V$25))","v":""},{"$f":"IF(COUNTIF($AH$11:$AH$17,$V$25)=0,\"\",COUNTIF($AH$11:$AH$17,$V$25))","v":""},{"$f":"IF(COUNTIF($AI$11:$AI$17,$V$25)=0,\"\",COUNTIF($AI$11:$AI$17,$V$25))","v":""},{"$f":"IF(COUNTIF($AJ$11:$AJ$17,$V$25)=0,\"\",COUNTIF($AJ$11:$AJ$17,$V$25))","v":""},{"$f":"IF(COUNTIF($AK$11:$AK$17,$V$25)=0,\"\",COUNTIF($AK$11:$AK$17,$V$25))","v":""},null,null,null,null,null,null,null,null,null,null,null,null,null,null,null,null,null,null,20]
[null,null,null,null,null,null,{"$f":"R66","v":""},null,{"$f":"IF(ISERROR(VLOOKUP(G26,Planning_général!$E$32:$F$46,2,0)),\"\",VLOOKUP(G26,Planning_général!$E$32:$F$46,2,0))","v":""},{"$f":"R68","v":""},null,{"$f":"IF(ISERROR(VLOOKUP(J26,Planning_général!$E$32:$F$46,2,0)),\"\",VLOOKUP(J26,Planning_général!$E$32:$F$46,2,0))","v":""},null,null,null,null,null,null,null,null,null,"N.D","","","","","","",{"$f":"IF(COUNTIF($AC$11:$AC$17,$V$26)=0,\"\",COUNTIF($AC$11:$AC$17,V26))","v":""},{"$f":"IF(COUNTIF($AD$11:$AD$17,$V$26)=0,\"\",COUNTIF($AD$11:$AD$17,$V$26))","v":""},{"$f":"IF(COUNTIF($AE$11:$AE$17,$V$26)=0,\"\",COUNTIF($AE$11:$AE$17,$V$26))","v":""},{"$f":"IF(COUNTIF($AF$11:$AF$17,$V$26)=0,\"\",COUNTIF($AF$11:$AF$17,$V$26))","v":""},{"$f":"IF(COUNTIF($AG$11:$AG$17,$V$26)=0,\"\",COUNTIF($AG$11:$AG$17,$V$26))","v":""},{"$f":"IF(COUNTIF($AH$11:$AH$17,$V$26)=0,\"\",COUNTIF($AH$11:$AH$17,$V$26))","v":""},{"$f":"IF(COUNTIF($AI$11:$AI$17,$V$26)=0,\"\",COUNTIF($AI$11:$AI$17,$V$26))","v":""},{"$f":"IF(COUNTIF($AJ$11:$AJ$17,$V$26)=0,\"\",COUNTIF($AJ$11:$AJ$17,$V$26))","v":""},{"$f":"IF(COUNTIF($AK$11:$AK$17,$V$26)=0,\"\",COUNTIF($AK$11:$AK$17,$V$26))","v":""},null,null,null,null,null,null,null,null,null,null,null,null,null,null,null,null,null,null,21]
[null,"Absences (CP/ Modul/      Repos       /Formation)",null,"Lundi",{"$f":"VLOOKUP(D27,O73:S79,3,0)","v":""},null,null,null,null,null,null,null,null,null,null,null,null,null,null,null,null,"J","","","","","","",{"$f":"IF(COUNTIF($AC$11:$AC$17,$V$27)=0,\"\",COUNTIF($AC$11:$AC$17,V27))","v":""},{"$f":"IF(COUNTIF($AD$11:$AD$17,$V$27)=0,\"\",COUNTIF($AD$11:$AD$17,$V$27))","v":""},{"$f":"IF(COUNTIF($AE$11:$AE$17,$V$27)=0,\"\",COUNTIF($AE$11:$AE$17,$V$27))","v":""},{"$f":"IF(COUNTIF($AF$11:$AF$17,$V$27)=0,\"\",COUNTIF($AF$11:$AF$17,$V$27))","v":""},{"$f":"IF(COUNTIF($AG$11:$AG$17,$V$27)=0,\"\",COUNTIF($AG$11:$AG$17,$V$27))","v":""},{"$f":"IF(COUNTIF($AH$11:$AH$17,$V$27)=0,\"\",COUNTIF($AH$11:$AH$17,$V$27))","v":""},{"$f":"IF(COUNTIF($AI$11:$AI$17,$V$27)=0,\"\",COUNTIF($AI$11:$AI$17,$V$27))","v":""},{"$f":"IF(COUNTIF($AJ$11:$AJ$17,$V$27)=0,\"\",COUNTIF($AJ$11:$AJ$17,$V$27))","v":""},{"$f":"IF(COUNTIF($AK$11:$AK$17,$V$27)=0,\"\",COUNTIF($AK$11:$AK$17,$V$27))","v":""},null,null,null,null,null,null,null,null,null,null,null,null,null,null,null,null,null,null,22]
[null,null,null,"Mardi",{"$f":"VLOOKUP(D28,O74:S80,3,0)","v":{"$error":"#N/A"}},null,null,null,null,null,null,null,null,null,null,null,null,null,null,null,null,"S.A",{"$f":"IF(COUNTIF($W$11:$W$17,V28)=0,\"\",COUNTIF($W$11:$W$17,V28))","v":""},{"$f":"IF(COUNTIF($X$11:$X$17,V28)=0,\"\",COUNTIF($X$11:$X$17,V28))","v":""},"","","",{"$f":"IF(COUNTIF($AB$11:$AB$17,V28)=0,\"\",COUNTIF($AB$11:$AB$17,V28))","v":""},"",{"$f":"IF(COUNTIF($AD$11:$AD$17,$V$28)=0,\"\",COUNTIF($AD$11:$AD$17,$V$28))","v":""},{"$f":"IF(COUNTIF($AE$11:$AE$17,$V$28)=0,\"\",COUNTIF($AE$11:$AE$17,$V$28))","v":""},{"$f":"IF(COUNTIF($AF$11:$AF$17,$V$28)=0,\"\",COUNTIF($AF$11:$AF$17,$V$28))","v":""},{"$f":"IF(COUNTIF($AG$11:$AG$17,$V$28)=0,\"\",COUNTIF($AG$11:$AG$17,$V$28))","v":""},{"$f":"IF(COUNTIF($AH$11:$AH$17,$V$28)=0,\"\",COUNTIF($AH$11:$AH$17,$V$28))","v":""},{"$f":"IF(COUNTIF($AI$11:$AI$17,$V$28)=0,\"\",COUNTIF($AI$11:$AI$17,$V$28))","v":""},{"$f":"IF(COUNTIF($AJ$11:$AJ$17,$V$28)=0,\"\",COUNTIF($AJ$11:$AJ$17,$V$28))","v":""},{"$f":"IF(COUNTIF($AK$11:$AK$17,$V$28)=0,\"\",COUNTIF($AK$11:$AK$17,$V$28))","v":""},null,null,null,null,null,null,null,null,null,null,null,null,null,null,null,null,null,null,23]
[null,null,null,"Mercredi",{"$f":"VLOOKUP(D29,O75:S81,3,0)","v":{"$error":"#N/A"}},null,null,null,null,null,null,null,null,null,null,null,null,null,null,null,null,"S.D",{"$f":"IF(COUNTIF($W$11:$W$17,V29)=0,\"\",COUNTIF($W$11:$W$17,V29))","v":""},{"$f":"IF(COUNTIF($X$11:$X$17,V29)=0,\"\",COUNTIF($X$11:$X$17,V29))","v":""},{"$f":"IF(COUNTIF($Y$11:$Y$17,V29)=0,\"\",COUNTIF($Y$11:$Y$17,V29))","v":""},{"$f":"IF(COUNTIF($Z$11:$Z$17,V29)=0,\"\",COUNTIF($Z$11:$Z$17,V29))","v":""},{"$f":"IF(COUNTIF($AA$11:$AA$17,V29)=0,\"\",COUNTIF($AA$11:$AA$17,V29))","v":""},{"$f":"IF(COUNTIF($AB$11:$AB$17,V29)=0,\"\",COUNTIF($AB$11:$AB$17,V29))","v":""},{"$f":"IF(COUNTIF($AC$11:$AC$17,V29)=0,\"\",COUNTIF($AC$11:$AC$17,V29))","v":""},{"$f":"IF(COUNTIF($AD$11:$AD$17,$V$29)=0,\"\",COUNTIF($AD$11:$AD$17,$V$29))","v":""},{"$f":"IF(COUNTIF($AE$11:$AE$17,$V$29)=0,\"\",COUNTIF($AE$11:$AE$17,$V$29))","v":""},{"$f":"IF(COUNTIF($AF$11:$AF$17,$V$29)=0,\"\",COUNTIF($AF$11:$AF$17,$V$29))","v":""},{"$f":"IF(COUNTIF($AG$11:$AG$17,$V$29)=0,\"\",COUNTIF($AG$11:$AG$17,$V$29))","v":""},{"$f":"IF(COUNTIF($AH$11:$AH$17,$V$29)=0,\"\",COUNTIF($AH$11:$AH$17,$V$29))","v":""},{"$f":"IF(COUNTIF($AI$11:$AI$17,$V$29)=0,\"\",COUNTIF($AI$11:$AI$17,$V$29))","v":""},{"$f":"IF(COUNTIF($AJ$11:$AJ$17,$V$29)=0,\"\",COUNTIF($AJ$11:$AJ$17,$V$29))","v":""},{"$f":"IF(COUNTIF($AK$11:$AK$17,$V$29)=0,\"\",COUNTIF($AK$11:$AK$17,$V$29))","v":""},null,null,null,null,null,null,null,null,null,null,null,null,null,null,null,null,null,null,24]
[null,null,null,"Jeudi",{"$f":"VLOOKUP(D30,O76:S82,3,0)","v":{"$error":"#N/A"}},null,null,null,null,null,null,null,null,null,null,null,null,null,null,null,null,"SM.A",{"$f":"IF(COUNTIF($W$11:$W$17,V30)=0,\"\",COUNTIF($W$11:$W$17,V30))","v":""},{"$f":"IF(COUNTIF($X$11:$X$17,V30)=0,\"\",COUNTIF($X$11:$X$17,V30))","v":""},{"$f":"IF(COUNTIF($Y$11:$Y$17,V30)=0,\"\",COUNTIF($Y$11:$Y$17,V30))","v":""},{"$f":"IF(COUNTIF($Z$11:$Z$17,V30)=0,\"\",COUNTIF($Z$11:$Z$17,V30))","v":""},{"$f":"IF(COUNTIF($AA$11:$AA$17,V30)=0,\"\",COUNTIF($AA$11:$AA$17,V30))","v":""},{"$f":"IF(COUNTIF($AB$11:$AB$17,V30)=0,\"\",COUNTIF($AB$11:$AB$17,V30))","v":""},{"$f":"IF(COUNTIF($AC$11:$AC$17,V30)=0,\"\",COUNTIF($AC$11:$AC$17,V30))","v":""},{"$f":"IF(COUNTIF($AD$11:$AD$17,$V$30)=0,\"\",COUNTIF($AD$11:$AD$17,$V$30))","v":""},{"$f":"IF(COUNTIF($AE$11:$AE$17,$V$30)=0,\"\",COUNTIF($AE$11:$AE$17,$V$30))","v":""},{"$f":"IF(COUNTIF($AF$11:$AF$17,$V$30)=0,\"\",COUNTIF($AF$11:$AF$17,$V$30))","v":""},{"$f":"IF(COUNTIF($AG$11:$AG$17,$V$30)=0,\"\",COUNTIF($AG$11:$AG$17,$V$30))","v":""},{"$f":"IF(COUNTIF($AH$11:$AH$17,$V$30)=0,\"\",COUNTIF($AH$11:$AH$17,$V$30))","v":""},{"$f":"IF(COUNTIF($AI$11:$AI$17,$V$30)=0,\"\",COUNTIF($AI$11:$AI$17,$V$30))","v":""},{"$f":"IF(COUNTIF($AJ$11:$AJ$17,$V$30)=0,\"\",COUNTIF($AJ$11:$AJ$17,$V$30))","v":""},{"$f":"IF(COUNTIF($AK$11:$AK$17,$V$30)=0,\"\",COUNTIF($AK$11:$AK$17,$V$30))","v":""}]
[null,null,null,"Vendredi",{"$f":"VLOOKUP(D31,O77:S84,3,0)","v":{"$error":"#N/A"}},null,null,null,null,null,null,null,null,null,null,null,null,null,null,null,null,"SM.D",{"$f":"IF(COUNTIF($W$11:$W$17,V31)=0,\"\",COUNTIF($W$11:$W$17,V31))","v":""},{"$f":"IF(COUNTIF($X$11:$X$17,V31)=0,\"\",COUNTIF($X$11:$X$17,V31))","v":""},{"$f":"IF(COUNTIF($Y$11:$Y$17,V31)=0,\"\",COUNTIF($Y$11:$Y$17,V31))","v":""},{"$f":"IF(COUNTIF($Z$11:$Z$17,V31)=0,\"\",COUNTIF($Z$11:$Z$17,V31))","v":""},{"$f":"IF(COUNTIF($AA$11:$AA$17,V31)=0,\"\",COUNTIF($AA$11:$AA$17,V31))","v":""},{"$f":"IF(COUNTIF($AB$11:$AB$17,V31)=0,\"\",COUNTIF($AB$11:$AB$17,V31))","v":""},{"$f":"IF(COUNTIF($AC$11:$AC$17,V31)=0,\"\",COUNTIF($AC$11:$AC$17,V31))","v":""},{"$f":"IF(COUNTIF($AD$11:$AD$17,$V$31)=0,\"\",COUNTIF($AD$11:$AD$17,$V$31))","v":""},{"$f":"IF(COUNTIF($AE$11:$AE$17,$V$31)=0,\"\",COUNTIF($AE$11:$AE$17,$V$31))","v":""},{"$f":"IF(COUNTIF($AF$11:$AF$17,$V$31)=0,\"\",COUNTIF($AF$11:$AF$17,$V$31))","v":""},{"$f":"IF(COUNTIF($AG$11:$AG$17,$V$31)=0,\"\",COUNTIF($AG$11:$AG$17,$V$31))","v":""},{"$f":"IF(COUNTIF($AH$11:$AH$17,$V$31)=0,\"\",COUNTIF($AH$11:$AH$17,$V$31))","v":""},{"$f":"IF(COUNTIF($AI$11:$AI$17,$V$31)=0,\"\",COUNTIF($AI$11:$AI$17,$V$31))","v":""},{"$f":"IF(COUNTIF($AJ$11:$AJ$17,$V$31)=0,\"\",COUNTIF($AJ$11:$AJ$17,$V$31))","v":""},{"$f":"IF(COUNTIF($AK$11:$AK$17,$V$31)=0,\"\",COUNTIF($AK$11:$AK$17,$V$31))","v":""}]
[null,null,null,"Samedi",{"$f":"VLOOKUP(D32,O78:S85,3,0)","v":{"$error":"#N/A"}},null,null,null,null,null,null,null,null,null,null,null,null,null,null,null,null,"Max",{"$f":"MAX(W21:W31)","v":0},{"$f":"MAX(X21:X31)","v":0},0,0,0,{"$f":"MAX(AB21:AB31)","v":0},0,0,0,{"$f":"MAX(AF21:AF31)","v":0},0,0,0,0,0]
[null,null,null,null,null,null,null,null,null,null,null,null,null,null,null,null,null,null,null,null,null,"Mini",{"$f":"IF(MIN(W21:W31)=1,1,0)","v":0},0,0,0,0,0,0,0,0,0,0,0,0,0,0]
[null,null,null,null,null,null,null,null,null,null,null,null,null,null,null,null,null,null,null,null,null,null,null,null,null,null,null,null,null,null,null,null,null,null,null,null,null,null,null,null,null,null,null,null,null,null,null,null,null,null,null,null,null,null,null,25]
[null,null,null,null,null,null,null,null,null,null,null,null,null,null,null,null,null,"Techniciens",null,null,null,null,null,null,null,null,null,null,null,null,null,null,null,null,null,null,null,null,null,null,null,null,null,null,null,null,null,null,null,null,null,null,null,null,null,26]
[null,null,null,null,null,null,null,null,null,null,null,null,null,null,null,null,null,null,null,null,null,null,{"$f":"IF(W32=0,\"\",IF(W21=W32,$V$21,IF(W22=W32,$V$22,IF(W23=W32,$V$23,IF(W24=W32,$V$24,IF(W25=W32,$V$25,IF(W26=W32,$V$26,IF(W27=W32,$V$27,IF(W28=W32,$V$28,IF(W29=W32,$V$29,IF(W30=W32,$V$30,IF(W31=W32,$V$31,\"\"))))))))))))","v":""},{"$f":"IF(X32=0,\"\",IF(X21=X32,$V$21,IF(X22=X32,$V$22,IF(X23=X32,$V$23,IF(X24=X32,$V$24,IF(X25=X32,$V$25,IF(X26=X32,$V$26,IF(X27=X32,$V$27,IF(X28=X32,$V$28,IF(X29=X32,$V$29,IF(X30=X32,$V$30,IF(X31=X32,$V$31,\"\"))))))))))))","v":""},{"$f":"IF(Y32=0,\"\",IF(Y21=Y32,$V$21,IF(Y22=Y32,$V$22,IF(Y23=Y32,$V$23,IF(Y24=Y32,$V$24,IF(Y25=Y32,$V$25,IF(Y26=Y32,$V$26,IF(Y27=Y32,$V$27,IF(Y28=Y32,$V$28,IF(Y29=Y32,$V$29,IF(Y30=Y32,$V$30,IF(Y31=Y32,$V$31,\"\"))))))))))))","v":""},{"$f":"IF(Z32=0,\"\",IF(Z21=Z32,$V$21,IF(Z22=Z32,$V$22,IF(Z23=Z32,$V$23,IF(Z24=Z32,$V$24,IF(Z25=Z32,$V$25,IF(Z26=Z32,$V$26,IF(Z27=Z32,$V$27,IF(Z28=Z32,$V$28,IF(Z29=Z32,$V$29,IF(Z30=Z32,$V$30,IF(Z31=Z32,$V$31,\"\"))))))))))))","v":""},"","","",{"$f":"IF(AD32=0,\"\",IF(AD21=AD32,$V$21,IF(AD22=AD32,$V$22,IF(AD23=AD32,$V$23,IF(AD24=AD32,$V$24,IF(AD25=AD32,$V$25,IF(AD26=AD32,$V$26,IF(AD27=AD32,$V$27,IF(AD28=AD32,$V$28,IF(AD29=AD32,$V$29,IF(AD30=AD32,$V$30,IF(AD31=AD32,$V$31,\"\"))))))))))))","v":""},"",{"$f":"IF(AF32=0,\"\",IF(AF21=AF32,$V$21,IF(AF22=AF32,$V$22,IF(AF23=AF32,$V$23,IF(AF24=AF32,$V$24,IF(AF25=AF32,$V$25,IF(AF26=AF32,$V$26,IF(AF27=AF32,$V$27,IF(AF28=AF32,$V$28,IF(AF29=AF32,$V$29,IF(AF30=AF32,$V$30,IF(AF31=AF32,$V$31,\"\"))))))))))))","v":""},"","",{"$f":"IF(AI32=0,\"\",IF(AI21=AI32,$V$21,IF(AI22=AI32,$V$22,IF(AI23=AI32,$V$23,IF(AI24=AI32,$V$24,IF(AI25=AI32,$V$25,IF(AI26=AI32,$V$26,IF(AI27=AI32,$V$27,IF(AI28=AI32,$V$28,IF(AI29=AI32,$V$29,IF(AI30=AI32,$V$30,IF(AI31=AI32,$V$31,\"\"))))))))))))","v":""},{"$f":"IF(AJ32=0,\"\",IF(AJ21=AJ32,$V$21,IF(AJ22=AJ32,$V$22,IF(AJ23=AJ32,$V$23,IF(AJ24=AJ32,$V$24,IF(AJ25=AJ32,$V$25,IF(AJ26=AJ32,$V$26,IF(AJ27=AJ32,$V$27,IF(AJ28=AJ32,$V$28,IF(AJ29=AJ32,$V$29,IF(AJ30=AJ32,$V$30,IF(AJ31=AJ32,$V$31,\"\"))))))))))))","v":""},"",null,null,null,null,null,null,null,null,null,null,null,null,null,null,null,null,null,null,27]
[null,null,null,null,null,null,null,null,null,null,null,null,null,null,null,null,{"$f":"IF(R37=\"\",\"\",IF(ISNA(VLOOKUP(R37,Planning_général!$E$17:$F$62,2,0)),\"\",VLOOKUP(R37,Planning_général!$E$17:$F$62,2,0)))","v":""},{"$f":"IF(W37=1,$W$4,IF(X37=1,$X$4,IF(Y37=1,$Y$4,IF(Z37=1,Z4,IF(AA37=1,$AA$4,IF(AB37=1,$AB$4,IF(AC37=1,$AC$4,IF(AD37=1,$AD$4,IF(AE37=1,$AE$4,IF(AF37=1,$AF$4,IF(AG37=1,$AG$4,IF(AH37=1,AH4,IF(AI37=1,$AI$4,IF(AJ37=1,$AJ$4,IF(AK37=1,$AK$4,\"\")))))))))))))))","v":""},{"$f":"IF(U37=1,U$10,IF(V37=1,V$10,IF(W37=1,W$10,IF(X37=1,X$10,IF(Y37=1,Y$10,IF(Z37=1,Z$10,IF(AA37=1,AA$10,IF(AB37=1,AB$10,IF(AC37=1,AC$10,IF(AD37=1,AD$10,IF(AE37=1,AE$10,\"\")))))))))))","v":""},"Jrnée",null,"J",{"$f":"IF($V$37=W36,1,\"\")","v":""},{"$f":"IF(AND($V$37=$X$36,W37=\"\"),1,\"\")","v":""},{"$f":"IF(AND($V$37=$Y$36,X37=\"\",W37=\"\"),1,\"\")","v":""},{"$f":"IF(AND($V$37=Z36,W37=\"\",X37=\"\",Y37=\"\"),1,\"\")","v":""},{"$f":"IF(AND($V$37=AA36,X37=\"\",Y37=\"\",Z37=\"\",W37=\"\"),1,\"\")","v":""},{"$f":"IF(AND($V$37=AB36,Y37=\"\",Z37=\"\",AA37=\"\",X37=\"\",W37=\"\"),1,\"\")","v":""},{"$f":"IF(AND($V$37=AC36,Z37=\"\",AA37=\"\",AB37=\"\",Y37=\"\",X37=\"\",W37=\"\"),1,\"\")","v":""},{"$f":"IF(AND($V$37=AD36,AA37=\"\",AB37=\"\",AC37=\"\",Z37=\"\",Y37=\"\",X37=\"\",W37=\"\"),1,\"\")","v":""},{"$f":"IF(AND($V$37=AE36,AB37=\"\",AC37=\"\",AD37=\"\",AA37=\"\",Z37=\"\",Y37=\"\",X37=\"\",W37=\"\"),1,\"\")","v":""},{"$f":"IF(AND($V$37=AF36,AC37=\"\",AD37=\"\",AE37=\"\",AB37=\"\",AA37=\"\",Z37=\"\",Y37=\"\",X37=\"\",W37=\"\"),1,\"\")","v":""},{"$f":"IF(AND($V$37=AG36,AD37=\"\",AE37=\"\",AF37=\"\",AC37=\"\",AB37=\"\",AA37=\"\",Z37=\"\",Y37=\"\",X37=\"\",W37=\"\"),1,\"\")","v":""},{"$f":"IF(AND($V$37=AH36,AE37=\"\",AF37=\"\",AG37=\"\",AD37=\"\",AC37=\"\",AB37=\"\",AA37=\"\",Z37=\"\",Y37=\"\",X37=\"\",W37=\"\"),1,\"\")","v":""},{"$f":"IF(AND($V$37=AI36,AF37=\"\",AG37=\"\",AH37=\"\",AE37=\"\",AD37=\"\",AC37=\"\",AB37=\"\",AA37=\"\",Z37=\"\",Y37=\"\",X37=\"\",W37=\"\"),1,\"\")","v":""},{"$f":"IF(AND($V$37=AJ36,AG37=\"\",AH37=\"\",AI37=\"\",AF37=\"\",AE37=\"\",AD37=\"\",AC37=\"\",AB37=\"\",AA37=\"\",Z37=\"\",Y37=\"\",X37=\"\",W37=\"\"),1,\"\")","v":""},{"$f":"IF(AND($V$37=AK36,AH37=\"\",AI37=\"\",AJ37=\"\",AG37=\"\",AF37=\"\",AE37=\"\",AD37=\"\",AC37=\"\",AB37=\"\",AA37=\"\",Z37=\"\",Y37=\"\",X37=\"\",W37=\"\"),1,\"\")","v":""},null,null,null,null,null,null,null,null,null,null,null,null,null,null,null,null,null,null,28]
[null,null,null,null,null,null,null,null,null,null,null,null,null,null,null,null,{"$f":"IF(R38=\"\",\"\",IF(ISNA(VLOOKUP(R38,Planning_général!$E$17:$F$62,2,0)),\"\",VLOOKUP(R38,Planning_général!$E$17:$F$62,2,0)))","v":""},{"$f":"IF(W38=1,$W$4,IF(X38=1,$X$4,IF(Y38=1,$Y$4,IF(Z38=1,Z5,IF(AA38=1,$AA$4,IF(AB38=1,$AB$4,IF(AC38=1,$AC$4,IF(AD38=1,$AD$4,IF(AE38=1,$AE$4,IF(AF38=1,$AF$4,IF(AG38=1,$AG$4,IF(AH38=1,AH5,IF(AI38=1,$AI$4,IF(AJ38=1,$AJ$4,IF(AK38=1,$AK$4,\"\")))))))))))))))","v":""},{"$f":"IF(U38=1,U$10,IF(V38=1,V$10,IF(W38=1,W$10,IF(X38=1,X$10,IF(Y38=1,Y$10,IF(Z38=1,Z$10,IF(AA38=1,AA$10,IF(AB38=1,AB$10,IF(AC38=1,AC$10,IF(AD38=1,AD$10,IF(AE38=1,AE$10,\"\")))))))))))","v":""},null,null,"J",null,{"$f":"IF(AND(X$36=$V$38,W38=\"\",X37=\"\"),1,\"\")","v":""},{"$f":"IF(AND(Y$36=$V$38,X38=\"\",Y37=\"\"),1,\"\")","v":""},{"$f":"IF(AND(Z$36=$V$38,Y38=\"\",Z37=\"\"),1,\"\")","v":""},{"$f":"IF(AND(AA$36=$V$38,AA37=\"\",SUM($X$38:Z38)=0),1,\"\")","v":""},{"$f":"IF(AND(AB$36=$V$38,AB37=\"\",SUM($X$38:AA38)=0),1,\"\")","v":""},{"$f":"IF(AND(AC$36=$V$38,AC37=\"\",SUM($X$38:AB38)=0),1,\"\")","v":""},{"$f":"IF(AND(AD$36=$V$38,AD37=\"\",SUM($X$38:AC38)=0),1,\"\")","v":""},{"$f":"IF(AND(AE$36=$V$38,AE37=\"\",SUM($X$38:AD38)=0),1,\"\")","v":""},{"$f":"IF(AND(AF$36=$V$38,AF37=\"\",SUM($X$38:AE38)=0),1,\"\")","v":""},{"$f":"IF(AND(AG$36=$V$38,AG37=\"\",SUM($X$38:AF38)=0),1,\"\")","v":""},{"$f":"IF(AND(AH$36=$V$38,AH37=\"\",SUM($X$38:AG38)=0),1,\"\")","v":""},{"$f":"IF(AND(AI$36=$V$38,AI37=\"\",SUM($X$38:AH38)=0),1,\"\")","v":""},{"$f":"IF(AND(AJ$36=$V$38,AJ37=\"\",SUM($X$38:AI38)=0),1,\"\")","v":""},{"$f":"IF(AND(AK$36=$V$38,AK37=\"\",SUM($X$38:AJ38)=0),1,\"\")","v":""},null,null,null,null,null,null,null,null,null,null,null,null,null,null,null,null,null,null,29]
[]
[null,null,null,null,null,null,null,null,null,null,null,null,null,null,null,null,{"$f":"IF(R40=\"\",\"\",IF(ISNA(VLOOKUP(R40,Planning_général!$E$17:$F$62,2,0)),\"\",VLOOKUP(R40,Planning_général!$E$17:$F$62,2,0)))","v":""},{"$f":"IF(W40=1,$W$4,IF(X40=1,$X$4,IF(Y40=1,$Y$4,IF(Z40=1,Z4,IF(AA40=1,$AA$4,IF(AB40=1,$AB$4,IF(AC40=1,$AC$4,IF(AD40=1,$AD$4,IF(AE40=1,$AE$4,IF(AF40=1,$AF$4,IF(AG40=1,$AG$4,IF(AH40=1,AH8,IF(AI40=1,$AI$4,IF(AJ40=1,$AJ$4,IF(AK40=1,$AK$4,\"\")))))))))))))))","v":""},{"$f":"IF(U40=1,U$10,IF(V40=1,V$10,IF(W40=1,W$10,IF(X40=1,X$10,IF(Y40=1,Y$10,IF(Z40=1,Z$10,IF(AA40=1,AA$10,IF(AB40=1,AB$10,IF(AC40=1,AC$10,IF(AD40=1,AD$10,IF(AE40=1,AE$10,\"\")))))))))))","v":""},"Matin",null,"M.A",{"$f":"IF($V$40=W36,1,\"\")","v":""},{"$f":"IF(AND($V$40=$X$36,W40=\"\"),1,\"\")","v":""},{"$f":"IF(AND($V$40=$Y$36,X40=\"\",W40=\"\"),1,\"\")","v":""},{"$f":"IF(AND($V$40=Z36,W40=\"\",X40=\"\",Y40=\"\"),1,\"\")","v":""},{"$f":"IF(AND($V$40=AA36,X40=\"\",Y40=\"\",Z40=\"\",W40=\"\"),1,\"\")","v":""},{"$f":"IF(AND($V$40=AB36,Y40=\"\",Z40=\"\",AA40=\"\",X40=\"\",W40=\"\"),1,\"\")","v":""},{"$f":"IF(AND($V$40=AC36,Z40=\"\",AA40=\"\",AB40=\"\",Y40=\"\",X40=\"\",W40=\"\"),1,\"\")","v":""},{"$f":"IF(AND($V$40=AD36,AA40=\"\",AB40=\"\",AC40=\"\",Z40=\"\",Y40=\"\",X40=\"\",W40=\"\"),1,\"\")","v":""},{"$f":"IF(AND($V$40=AE36,AB40=\"\",AC40=\"\",AD40=\"\",AA40=\"\",Z40=\"\",Y40=\"\",X40=\"\",W40=\"\"),1,\"\")","v":""},{"$f":"IF(AND($V$40=AF36,AC40=\"\",AD40=\"\",AE40=\"\",AB40=\"\",AA40=\"\",Z40=\"\",Y40=\"\",X40=\"\",W40=\"\"),1,\"\")","v":""},{"$f":"IF(AND($V$40=AG36,AD40=\"\",AE40=\"\",AF40=\"\",AC40=\"\",AB40=\"\",AA40=\"\",Z40=\"\",Y40=\"\",X40=\"\",W40=\"\"),1,\"\")","v":""},{"$f":"IF(AND($V$40=AH36,AE40=\"\",AF40=\"\",AG40=\"\",AD40=\"\",AC40=\"\",AB40=\"\",AA40=\"\",Z40=\"\",Y40=\"\",X40=\"\",W40=\"\"),1,\"\")","v":""},{"$f":"IF(AND($V$40=AI36,AF40=\"\",AG40=\"\",AH40=\"\",AE40=\"\",AD40=\"\",AC40=\"\",AB40=\"\",AA40=\"\",Z40=\"\",Y40=\"\",X40=\"\",W40=\"\"),1,\"\")","v":""},{"$f":"IF(AND($V$40=AJ36,AG40=\"\",AH40=\"\",AI40=\"\",AF40=\"\",AE40=\"\",AD40=\"\",AC40=\"\",AB40=\"\",AA40=\"\",Z40=\"\",Y40=\"\",X40=\"\",W40=\"\"),1,\"\")","v":""},{"$f":"IF(AND($V$40=AK36,AH40=\"\",AI40=\"\",AJ40=\"\",AG40=\"\",AF40=\"\",AE40=\"\",AD40=\"\",AC40=\"\",AB40=\"\",AA40=\"\",Z40=\"\",Y40=\"\",X40=\"\",W40=\"\"),1,\"\")","v":""}]
[null,null,null,null,null,null,null,null,null,null,null,null,null,null,null,null,{"$f":"IF(R41=\"\",\"\",IF(ISNA(VLOOKUP(R41,Planning_général!$E$17:$F$62,2,0)),\"\",VLOOKUP(R41,Planning_général!$E$17:$F$62,2,0)))","v":""},{"$f":"IF(W41=1,$W$4,IF(X41=1,$X$4,IF(Y41=1,$Y$4,IF(Z41=1,Z4,IF(AA41=1,$AA$4,IF(AB41=1,$AB$4,IF(AC41=1,$AC$4,IF(AD41=1,$AD$4,IF(AE41=1,$AE$4,IF(AF41=1,$AF$4,IF(AG41=1,$AG$4,IF(AH41=1,AH4,IF(AI41=1,$AI$4,IF(AJ41=1,$AJ$4,IF(AK41=1,$AK$4,\"\")))))))))))))))","v":""},{"$f":"IF(U41=1,U$10,IF(V41=1,V$10,IF(W41=1,W$10,IF(X41=1,X$10,IF(Y41=1,Y$10,IF(Z41=1,Z$10,IF(AA41=1,AA$10,IF(AB41=1,AB$10,IF(AC41=1,AC$10,IF(AD41=1,AD$10,IF(AE41=1,AE$10,\"\")))))))))))","v":""},null,null,"M.A",null,{"$f":"IF(AND(X$36=$V$41,W41=\"\",X40=\"\"),1,\"\")","v":""},{"$f":"IF(AND(Y$36=$V$41,X41=\"\",Y40=\"\"),1,\"\")","v":""},{"$f":"IF(AND(Z$36=$V$41,Z40=\"\",SUM($X$41:Y41)=0),1,\"\")","v":""},{"$f":"IF(AND(AA$36=$V$41,AA40=\"\",SUM($X$41:Z41)=0),1,\"\")","v":""},{"$f":"IF(AND(AB$36=$V$41,AB40=\"\",SUM($X$41:AA41)=0),1,\"\")","v":""},{"$f":"IF(AND(AC$36=$V$41,AC40=\"\",SUM($X$41:AB41)=0),1,\"\")","v":""},{"$f":"IF(AND(AD$36=$V$41,AD40=\"\",SUM($X$41:AC41)=0),1,\"\")","v":""},{"$f":"IF(AND(AE$36=$V$41,AE40=\"\",SUM($X$41:AD41)=0),1,\"\")","v":""},{"$f":"IF(AND(AF$36=$V$41,AF40=\"\",SUM($X$41:AE41)=0),1,\"\")","v":""},{"$f":"IF(AND(AG$36=$V$41,AG40=\"\",SUM($X$41:AF41)=0),1,\"\")","v":""},{"$f":"IF(AND(AH$36=$V$41,AH40=\"\",SUM($X$41:AG41)=0),1,\"\")","v":""},{"$f":"IF(AND(AI$36=$V$41,AI40=\"\",SUM($X$41:AH41)=0),1,\"\")","v":""},{"$f":"IF(AND(AJ$36=$V$41,AJ40=\"\",SUM($X$41:AI41)=0),1,\"\")","v":""},{"$f":"IF(AND(AK$36=$V$41,AK40=\"\",SUM($X$41:AJ41)=0),1,\"\")","v":""}]
[null,null,null,null,null,null,null,null,null,null,null,null,null,null,null,null,{"$f":"IF(R42=\"\",\"\",IF(ISNA(VLOOKUP(R42,Planning_général!$E$17:$F$62,2,0)),\"\",VLOOKUP(R42,Planning_général!$E$17:$F$62,2,0)))","v":""},{"$f":"IF(W42=1,$W$4,IF(X42=1,$X$4,IF(Y42=1,$Y$4,IF(Z42=1,$Z$4,IF(AA42=1,$AA$4,IF(AB42=1,$AB$4,IF(AC42=1,$AC$4,IF(AD42=1,$AD$4,IF(AE42=1,$AE$4,IF(AF42=1,$AF$4,IF(AG42=1,$AG$4,IF(AH42=1,$AH$4,IF(AI42=1,$AI$4,IF(AJ42=1,$AJ$4,IF(AK42=1,$AK$4,\"\")))))))))))))))","v":""},"",null,null,"M.D",{"$f":"IF($V$42=$W$36,1,\"\")","v":""},{"$f":"IF(AND($V$42=$X$36,W42=\"\"),1,\"\")","v":""},{"$f":"IF(AND($V$42=$Y$36,X42=\"\",W42=\"\"),1,\"\")","v":""},{"$f":"IF(AND($V$42=Z36,W42=\"\",X42=\"\",Y42=\"\"),1,\"\")","v":""},{"$f":"IF(AND($V$42=$AA$36,X42=\"\",Y42=\"\",Z42=\"\",W42=\"\"),1,\"\")","v":""},{"$f":"IF(AND($V$42=$AB$36,Y42=\"\",Z42=\"\",AA42=\"\",X42=\"\",W42=\"\"),1,\"\")","v":""},{"$f":"IF(AND($V$42=$AC$36,Z42=\"\",AA42=\"\",AB42=\"\",Y42=\"\",X42=\"\",W42=\"\"),1,\"\")","v":""},{"$f":"IF(AND($V$42=AD36,AA42=\"\",AB42=\"\",AC42=\"\",Z42=\"\",Y42=\"\",X42=\"\",W42=\"\"),1,\"\")","v":""},{"$f":"IF(AND($V$42=$AE$36,AB42=\"\",AC42=\"\",AD42=\"\",AA42=\"\",Z42=\"\",Y42=\"\",X42=\"\",W42=\"\"),1,\"\")","v":""},{"$f":"IF(AND($V$42=$AF$36,AC42=\"\",AD42=\"\",AE42=\"\",AB42=\"\",AA42=\"\",Z42=\"\",Y42=\"\",X42=\"\",W42=\"\"),1,\"\")","v":""},{"$f":"IF(AND($V$42=$AG$36,AD42=\"\",AE42=\"\",AF42=\"\",AC42=\"\",AB42=\"\",AA42=\"\",Z42=\"\",Y42=\"\",X42=\"\",W42=\"\"),1,\"\")","v":""},{"$f":"IF(AND($V$42=$AH$36,AE42=\"\",AF42=\"\",AG42=\"\",AD42=\"\",AC42=\"\",AB42=\"\",AA42=\"\",Z42=\"\",Y42=\"\",X42=\"\",W42=\"\"),1,\"\")","v":""},{"$f":"IF(AND($V$42=$AI$36,AF42=\"\",AG42=\"\",AH42=\"\",AE42=\"\",AD42=\"\",AC42=\"\",AB42=\"\",AA42=\"\",Z42=\"\",Y42=\"\",X42=\"\",W42=\"\"),1,\"\")","v":""},{"$f":"IF(AND($V$42=$AJ$36,AG42=\"\",AH42=\"\",AI42=\"\",AF42=\"\",AE42=\"\",AD42=\"\",AC42=\"\",AB42=\"\",AA42=\"\",Z42=\"\",Y42=\"\",X42=\"\",W42=\"\"),1,\"\")","v":""},{"$f":"IF(AND($V$42=$AK$36,AH42=\"\",AI42=\"\",AJ42=\"\",AG42=\"\",AF42=\"\",AE42=\"\",AD42=\"\",AC42=\"\",AB42=\"\",AA42=\"\",Z42=\"\",Y42=\"\",X42=\"\",W42=\"\"),1,\"\")","v":""},null,null,null,null,null,null,null,null,null,null,null,null,null,null,null,null,null,null,30]
[null,null,null,null,null,null,null,null,null,null,null,null,null,null,null,null,{"$f":"IF(R43=\"\",\"\",IF(ISNA(VLOOKUP(R43,Planning_général!$E$17:$F$62,2,0)),\"\",VLOOKUP(R43,Planning_général!$E$17:$F$62,2,0)))","v":""},{"$f":"IF(W43=1,$W$4,IF(X43=1,$X$4,IF(Y43=1,$Y$4,IF(Z43=1,$Z$4,IF(AA43=1,$AA$4,IF(AB43=1,$AB$4,IF(AC43=1,$AC$4,IF(AD43=1,$AD$4,IF(AE43=1,$AE$4,IF(AF43=1,$AF$4,IF(AG43=1,$AG$4,IF(AH43=1,$AH$4,IF(AI43=1,$AI$4,IF(AJ43=1,$AJ$4,IF(AK43=1,$AK$4,\"\")))))))))))))))","v":""},{"$f":"IF(U43=1,U$10,IF(V43=1,V$10,IF(W43=1,W$10,IF(X43=1,X$10,IF(Y43=1,Y$10,IF(Z43=1,Z$10,IF(AA43=1,AA$10,IF(AB43=1,AB$10,IF(AC43=1,AC$10,IF(AD43=1,AD$10,IF(AE43=1,AE$10,\"\")))))))))))","v":""},null,null,"M.D",null,{"$f":"IF(AND(X$36=$V$43,W43=\"\",X42=\"\"),1,\"\")","v":""},{"$f":"IF(AND(Y$36=$V$43,X43=\"\",Y42=\"\"),1,\"\")","v":""},{"$f":"IF(AND(Z$36=$V$43,Z42=\"\",SUM($X$43:Y43)=0),1,\"\")","v":""},{"$f":"IF(AND(AA$36=$V$43,AA42=\"\",SUM($X$43:Z43)=0),1,\"\")","v":""},{"$f":"IF(AND(AB$36=$V$43,AB42=\"\",SUM($X$43:AA43)=0),1,\"\")","v":""},{"$f":"IF(AND(AC$36=$V$43,AC42=\"\",SUM($X$43:AB43)=0),1,\"\")","v":""},{"$f":"IF(AND(AD$36=$V$43,AD42=\"\",SUM($X$43:AC43)=0),1,\"\")","v":""},{"$f":"IF(AND(AE$36=$V$43,AE42=\"\",SUM($X$43:AD43)=0),1,\"\")","v":""},{"$f":"IF(AND(AF$36=$V$43,AF42=\"\",SUM($X$43:AE43)=0),1,\"\")","v":""},{"$f":"IF(AND(AG$36=$V$43,AG42=\"\",SUM($X$43:AF43)=0),1,\"\")","v":""},{"$f":"IF(AND(AH$36=$V$43,AH42=\"\",SUM($X$43:AG43)=0),1,\"\")","v":""},{"$f":"IF(AND(AI$36=$V$43,AI42=\"\",SUM($X$43:AH43)=0),1,\"\")","v":""},{"$f":"IF(AND(AJ$36=$V$43,AJ42=\"\",SUM($X$43:AI43)=0),1,\"\")","v":""},{"$f":"IF(AND(AK$36=$V$43,AK42=\"\",SUM($X$43:AJ43)=0),1,\"\")","v":""}]
[null,null,null,null,null,null,null,null,null,null,null,null,null,null,null,null,null,null,null,null,null,null,null,null,null,null,null,null,null,null,null,null,null,null,null,null,null,null,null,null,null,null,null,null,null,null,null,null,null,null,null,null,null,null,null,31]
[null,null,null,null,null,null,null,null,null,null,null,null,null,null,null,null,null,null,null,null,null,null,null,null,null,null,null,null,null,null,null,null,null,null,null,null,null,null,null,null,null,null,null,null,null,null,null,null,null,null,null,null,null,null,null,35]
[null,null,null,null,null,null,null,null,null,null,null,null,null,null,null,null,{"$f":"IF(R46=\"\",\"\",IF(ISNA(VLOOKUP(R46,Planning_général!$E$17:$F$62,2,0)),\"\",VLOOKUP(R46,Planning_général!$E$17:$F$62,2,0)))","v":""},{"$f":"IF(W46=1,$W$4,IF(X46=1,$X$4,IF(Y46=1,$Y$4,IF(Z46=1,Z4,IF(AA46=1,$AA$4,IF(AB46=1,$AB$4,IF(AC46=1,$AC$4,IF(AD46=1,$AD$4,IF(AE46=1,$AE$4,IF(AF46=1,$AF$4,IF(AG46=1,$AG$4,IF(AH46=1,AH13,IF(AI46=1,$AI$4,IF(AJ46=1,$AJ$4,IF(AK46=1,$AK$4,\"\")))))))))))))))","v":""},{"$f":"IF(U46=1,U$10,IF(V46=1,V$10,IF(W46=1,W$10,IF(X46=1,X$10,IF(Y46=1,Y$10,IF(Z46=1,Z$10,IF(AA46=1,AA$10,IF(AB46=1,AB$10,IF(AC46=1,AC$10,IF(AD46=1,AD$10,IF(AE46=1,AE$10,\"\")))))))))))","v":""},"Début",null,"AM.A",{"$f":"IF($V$46=$W$36,1,\"\")","v":""},{"$f":"IF(AND($V$46=$X$36,W46=\"\"),1,\"\")","v":""},{"$f":"IF(AND($V$46=$Y$36,X46=\"\",W46=\"\"),1,\"\")","v":""},{"$f":"IF(AND($V$46=Z36,W46=\"\",X46=\"\",Y46=\"\"),1,\"\")","v":""},{"$f":"IF(AND($V$46=$AA$36,X46=\"\",Y46=\"\",Z46=\"\",W46=\"\"),1,\"\")","v":""},{"$f":"IF(AND($V$46=$AB$36,Y46=\"\",Z46=\"\",AA46=\"\",X46=\"\",W46=\"\"),1,\"\")","v":""},{"$f":"IF(AND($V$46=AC36,Z46=\"\",AA46=\"\",AB46=\"\",Y46=\"\",X46=\"\",W46=\"\"),1,\"\")","v":""},{"$f":"IF(AND($V$46=AD36,AA46=\"\",AB46=\"\",AC46=\"\",Z46=\"\",Y46=\"\",X46=\"\",W46=\"\"),1,\"\")","v":""},{"$f":"IF(AND($V$46=$AE$36,AB46=\"\",AC46=\"\",AD46=\"\",AA46=\"\",Z46=\"\",Y46=\"\",X46=\"\",W46=\"\"),1,\"\")","v":""},{"$f":"IF(AND($V$46=$AF$36,AC46=\"\",AD46=\"\",AE46=\"\",AB46=\"\",AA46=\"\",Z46=\"\",Y46=\"\",X46=\"\",W46=\"\"),1,\"\")","v":""},{"$f":"IF(AND($V$46=$AG$36,AD46=\"\",AE46=\"\",AF46=\"\",AC46=\"\",AB46=\"\",AA46=\"\",Z46=\"\",Y46=\"\",X46=\"\",W46=\"\"),1,\"\")","v":""},{"$f":"IF(AND($V$46=$AH$36,AE46=\"\",AF46=\"\",AG46=\"\",AD46=\"\",AC46=\"\",AB46=\"\",AA46=\"\",Z46=\"\",Y46=\"\",X46=\"\",W46=\"\"),1,\"\")","v":""},{"$f":"IF(AND($V$46=$AI$36,AF46=\"\",AG46=\"\",AH46=\"\",AE46=\"\",AD46=\"\",AC46=\"\",AB46=\"\",AA46=\"\",Z46=\"\",Y46=\"\",X46=\"\",W46=\"\"),1,\"\")","v":""},{"$f":"IF(AND($V$46=$AJ$36,AG46=\"\",AH46=\"\",AI46=\"\",AF46=\"\",AE46=\"\",AD46=\"\",AC46=\"\",AB46=\"\",AA46=\"\",Z46=\"\",Y46=\"\",X46=\"\",W46=\"\"),1,\"\")","v":""},{"$f":"IF(AND($V$46=$AK$36,AH46=\"\",AI46=\"\",AJ46=\"\",AG46=\"\",AF46=\"\",AE46=\"\",AD46=\"\",AC46=\"\",AB46=\"\",AA46=\"\",Z46=\"\",Y46=\"\",X46=\"\",W46=\"\"),1,\"\")","v":""},null,null,null,null,null,null,null,null,null,null,null,null,null,null,null,null,null,null,36]
[null,null,null,null,null,null,null,null,null,null,null,null,null,null,null,null,{"$f":"IF(R47=\"\",\"\",IF(ISNA(VLOOKUP(R47,Planning_général!$E$17:$F$62,2,0)),\"\",VLOOKUP(R47,Planning_général!$E$17:$F$62,2,0)))","v":""},{"$f":"IF(W47=1,$W$4,IF(X47=1,$X$4,IF(Y47=1,$Y$4,IF(Z47=1,$Z$4,IF(AA47=1,$AA$4,IF(AB47=1,$AB$4,IF(AC47=1,$AC$4,IF(AD47=1,$AD$4,IF(AE47=1,$AE$4,IF(AF47=1,$AF$4,IF(AG47=1,$AG$4,IF(AH47=1,$AH$4,IF(AI47=1,$AI$4,IF(AJ47=1,$AJ$4,IF(AK47=1,$AK$4,\"\")))))))))))))))","v":""},{"$f":"IF(U47=1,U$10,IF(V47=1,V$10,IF(W47=1,W$10,IF(X47=1,X$10,IF(Y47=1,Y$10,IF(Z47=1,Z$10,IF(AA47=1,AA$10,IF(AB47=1,AB$10,IF(AC47=1,AC$10,IF(AD47=1,AD$10,IF(AE47=1,AE$10,\"\")))))))))))","v":""},null,null,"AM.A",null,{"$f":"IF(AND(X$36=$V$47,W47=\"\",X46=\"\"),1,\"\")","v":""},{"$f":"IF(AND(Y$36=$V$47,X47=\"\",Y46=\"\"),1,\"\")","v":""},{"$f":"IF(AND(Z$36=$V$47,Z46=\"\",SUM($X47:Y$47)=0),1,\"\")","v":""},{"$f":"IF(AND(AA$36=$V$47,AA46=\"\",SUM($X$47:Z47)=0),1,\"\")","v":""},{"$f":"IF(AND(AB$36=$V$47,AB46=\"\",SUM($X$47:AA47)=0),1,\"\")","v":""},{"$f":"IF(AND(AC$36=$V$47,AC46=\"\",SUM($X$47:AB47)=0),1,\"\")","v":""},{"$f":"IF(AND(AD$36=$V$47,AD46=\"\",SUM($X$47:AC47)=0),1,\"\")","v":""},{"$f":"IF(AND(AE$36=$V$47,AE46=\"\",SUM($X$47:AD47)=0),1,\"\")","v":""},{"$f":"IF(AND(AF$36=$V$47,AF46=\"\",SUM($X$47:AE47)=0),1,\"\")","v":""},{"$f":"IF(AND(AG$36=$V$47,AG46=\"\",SUM($X$47:AF47)=0),1,\"\")","v":""},{"$f":"IF(AND(AH$36=$V$47,AH46=\"\",SUM($X$47:AG47)=0),1,\"\")","v":""},{"$f":"IF(AND(AI$36=$V$47,AI46=\"\",SUM($X$47:AH47)=0),1,\"\")","v":""},{"$f":"IF(AND(AJ$36=$V$47,AJ46=\"\",SUM($X$47:AI47)=0),1,\"\")","v":""},{"$f":"IF(AND(AK$36=$V$47,AK46=\"\",SUM($X$47:AJ47)=0),1,\"\")","v":""},null,null,null,null,null,null,null,null,null,null,null,null,null,null,null,null,null,null,37]
[null,null,null,null,null,null,null,null,null,null,null,null,null,null,null,null,{"$f":"IF(R48=\"\",\"\",IF(ISNA(VLOOKUP(R48,Planning_général!$E$17:$F$62,2,0)),\"\",VLOOKUP(R48,Planning_général!$E$17:$F$62,2,0)))","v":""},{"$f":"IF(W48=1,$W$4,IF(X48=1,$X$4,IF(Y48=1,$Y$4,IF(Z48=1,Z11,IF(AA48=1,$AA$4,IF(AB48=1,$AB$4,IF(AC48=1,$AC$4,IF(AD48=1,$AD$4,IF(AE48=1,$AE$4,IF(AF48=1,$AF$4,IF(AG48=1,$AG$4,IF(AH48=1,$AH$4,IF(AI48=1,$AI$4,IF(AJ48=1,$AJ$4,IF(AK48=1,$AK$4,\"\")))))))))))))))","v":""},"",null,null,"AM.D",{"$f":"IF($V$48=$W$36,1,\"\")","v":""},{"$f":"IF(AND($V$48=$X$36,W48=\"\"),1,\"\")","v":""},{"$f":"IF(AND($V$48=$Y$36,X48=\"\",W48=\"\"),1,\"\")","v":""},{"$f":"IF(AND($V$48=Z36,W48=\"\",X48=\"\",Y48=\"\"),1,\"\")","v":""},{"$f":"IF(AND($V$48=$AA$36,X48=\"\",Y48=\"\",Z48=\"\",W48=\"\"),1,\"\")","v":""},{"$f":"IF(AND($V$48=$AB$36,Y48=\"\",Z48=\"\",AA48=\"\",X48=\"\",W48=\"\"),1,\"\")","v":""},{"$f":"IF(AND($V$48=$AC$36,Z48=\"\",AA48=\"\",AB48=\"\",Y48=\"\",X48=\"\",W48=\"\"),1,\"\")","v":""},{"$f":"IF(AND($V$48=AD36,AA48=\"\",AB48=\"\",AC48=\"\",Z48=\"\",Y48=\"\",X48=\"\",W48=\"\"),1,\"\")","v":""},{"$f":"IF(AND($V$48=$AE$36,AB48=\"\",AC48=\"\",AD48=\"\",AA48=\"\",Z48=\"\",Y48=\"\",X48=\"\",W48=\"\"),1,\"\")","v":""},{"$f":"IF(AND($V$48=$AF$36,AC48=\"\",AD48=\"\",AE48=\"\",AB48=\"\",AA48=\"\",Z48=\"\",Y48=\"\",X48=\"\",W48=\"\"),1,\"\")","v":""},{"$f":"IF(AND($V$48=$AG$36,AD48=\"\",AE48=\"\",AF48=\"\",AC48=\"\",AB48=\"\",AA48=\"\",Z48=\"\",Y48=\"\",X48=\"\",W48=\"\"),1,\"\")","v":""},{"$f":"IF(AND($V$48=$AH$36,AE48=\"\",AF48=\"\",AG48=\"\",AD48=\"\",AC48=\"\",AB48=\"\",AA48=\"\",Z48=\"\",Y48=\"\",X48=\"\",W48=\"\"),1,\"\")","v":""},{"$f":"IF(AND($V$48=$AI$36,AF48=\"\",AG48=\"\",AH48=\"\",AE48=\"\",AD48=\"\",AC48=\"\",AB48=\"\",AA48=\"\",Z48=\"\",Y48=\"\",X48=\"\",W48=\"\"),1,\"\")","v":""},{"$f":"IF(AND($V$48=$AJ$36,AG48=\"\",AH48=\"\",AI48=\"\",AF48=\"\",AE48=\"\",AD48=\"\",AC48=\"\",AB48=\"\",AA48=\"\",Z48=\"\",Y48=\"\",X48=\"\",W48=\"\"),1,\"\")","v":""},{"$f":"IF(AND($V$48=$AK$36,AH48=\"\",AI48=\"\",AJ48=\"\",AG48=\"\",AF48=\"\",AE48=\"\",AD48=\"\",AC48=\"\",AB48=\"\",AA48=\"\",Z48=\"\",Y48=\"\",X48=\"\",W48=\"\"),1,\"\")","v":""},null,null,null,null,null,null,null,null,null,null,null,null,null,null,null,null,null,null,38]
[null,null,null,null,null,null,null,null,null,null,null,null,null,null,null,null,{"$f":"IF(R49=\"\",\"\",IF(ISNA(VLOOKUP(R49,Planning_général!$E$17:$F$62,2,0)),\"\",VLOOKUP(R49,Planning_général!$E$17:$F$62,2,0)))","v":""},{"$f":"IF(W49=1,$W$4,IF(X49=1,$X$4,IF(Y49=1,$Y$4,IF(Z49=1,Z12,IF(AA49=1,$AA$4,IF(AB49=1,$AB$4,IF(AC49=1,$AC$4,IF(AD49=1,$AD$4,IF(AE49=1,$AE$4,IF(AF49=1,$AF$4,IF(AG49=1,$AG$4,IF(AH49=1,$AH$4,IF(AI49=1,$AI$4,IF(AJ49=1,$AJ$4,IF(AK49=1,$AK$4,\"\")))))))))))))))","v":""},{"$f":"IF(U49=1,U$10,IF(V49=1,V$10,IF(W49=1,W$10,IF(X49=1,X$10,IF(Y49=1,Y$10,IF(Z49=1,Z$10,IF(AA49=1,AA$10,IF(AB49=1,AB$10,IF(AC49=1,AC$10,IF(AD49=1,AD$10,IF(AE49=1,AE$10,\"\")))))))))))","v":""},null,null,"AM.D",null,{"$f":"IF(AND(X$36=$V$49,W49=\"\",X48=\"\"),1,\"\")","v":""},{"$f":"IF(AND(Y$36=$V$49,X49=\"\",Y48=\"\"),1,\"\")","v":""},{"$f":"IF(AND(Z$36=$V$49,Z48=\"\",SUM($X$49:Y49)=0),1,\"\")","v":""},{"$f":"IF(AND(AA$36=$V$49,AA48=\"\",SUM($X$49:Z49)=0),1,\"\")","v":""},{"$f":"IF(AND(AB$36=$V$49,AB48=\"\",SUM($X$49:AA49)=0),1,\"\")","v":""},{"$f":"IF(AND(AC$36=$V$49,AC48=\"\",SUM($X$49:AB49)=0),1,\"\")","v":""},{"$f":"IF(AND(AD$36=$V$49,AD48=\"\",SUM($X$49:AC49)=0),1,\"\")","v":""},{"$f":"IF(AND(AE$36=$V$49,AE48=\"\",SUM($X$49:AD49)=0),1,\"\")","v":""},{"$f":"IF(AND(AF$36=$V$49,AF48=\"\",SUM($X$49:AE49)=0),1,\"\")","v":""},{"$f":"IF(AND(AG$36=$V$49,AG48=\"\",SUM($X$49:AF49)=0),1,\"\")","v":""},{"$f":"IF(AND(AH$36=$V$49,AH48=\"\",SUM($X$49:AG49)=0),1,\"\")","v":""},{"$f":"IF(AND(AI$36=$V$49,AI48=\"\",SUM($X$49:AH49)=0),1,\"\")","v":""},{"$f":"IF(AND(AJ$36=$V$49,AJ48=\"\",SUM($X$49:AI49)=0),1,\"\")","v":""},{"$f":"IF(AND(AK$36=$V$49,AK48=\"\",SUM($X$49:AJ49)=0),1,\"\")","v":""}]
[null,null,null,null,null,null,null,null,null,null,null,null,null,null,null,null,null,null,null,null,null,null,null,null,null,null,null,null,null,null,null,null,null,null,null,null,null,null,null,null,null,null,null,null,null,null,null,null,null,null,null,null,null,null,null,39]
[null,null,null,null,null,null,null,null,null,null,null,null,null,null,null,null,null,null,null,null,null,null,null,null,null,null,null,null,null,null,null,null,null,null,null,null,null,null,null,null,null,null,null,null,null,null,null,null,null,null,null,null,null,null,null,40]
[null,null,null,null,null,null,null,null,null,null,null,null,null,null,null,null,{"$f":"IF(R52=\"\",\"\",IF(ISNA(VLOOKUP(R52,Planning_général!$E$17:$F$62,2,0)),\"\",VLOOKUP(R52,Planning_général!$E$17:$F$62,2,0)))","v":""},{"$f":"IF(W52=1,$W$4,IF(X52=1,$X$4,IF(Y52=1,$Y$4,IF(Z52=1,Z4,IF(AA52=1,$AA$4,IF(AB52=1,$AB$4,IF(AC52=1,$AC$4,IF(AD52=1,$AD$4,IF(AE52=1,$AE$4,IF(AF52=1,$AF$4,IF(AG52=1,$AG$4,IF(AH52=1,AH4,IF(AI52=1,$AI$4,IF(AJ52=1,$AJ$4,IF(AK52=1,$AK$4,\"\")))))))))))))))","v":""},{"$f":"IF(U52=1,U$10,IF(V52=1,V$10,IF(W52=1,W$10,IF(X52=1,X$10,IF(Y52=1,Y$10,IF(Z52=1,Z$10,IF(AA52=1,AA$10,IF(AB52=1,AB$10,IF(AC52=1,AC$10,IF(AD52=1,AD$10,IF(AE52=1,AE$10,\"\")))))))))))","v":""},"Soir",null,"S.A",{"$f":"IF($V$52=$W$36,1,\"\")","v":""},{"$f":"IF(AND($V$52=$X$36,W52=\"\"),1,\"\")","v":""},{"$f":"IF(AND($V$52=$Y$36,X52=\"\",W52=\"\"),1,\"\")","v":""},{"$f":"IF(AND($V$52=$Z$36,W52=\"\",X52=\"\",Y52=\"\"),1,\"\")","v":""},{"$f":"IF(AND($V$52=$AA$36,X52=\"\",Y52=\"\",Z52=\"\",W52=\"\"),1,\"\")","v":""},{"$f":"IF(AND($V$52=$AB$36,Y52=\"\",Z52=\"\",AA52=\"\",X52=\"\",W52=\"\"),1,\"\")","v":""},{"$f":"IF(AND($V$52=AC36,Z52=\"\",AA52=\"\",AB52=\"\",Y52=\"\",X52=\"\",W52=\"\"),1,\"\")","v":""},{"$f":"IF(AND($V$52=$AD$36,AA52=\"\",AB52=\"\",AC52=\"\",Z52=\"\",Y52=\"\",X52=\"\",W52=\"\"),1,\"\")","v":""},{"$f":"IF(AND($V$52=$AE$36,AB52=\"\",AC52=\"\",AD52=\"\",AA52=\"\",Z52=\"\",Y52=\"\",X52=\"\",W52=\"\"),1,\"\")","v":""},{"$f":"IF(AND($V$52=$AF$36,AC52=\"\",AD52=\"\",AE52=\"\",AB52=\"\",AA52=\"\",Z52=\"\",Y52=\"\",X52=\"\",W52=\"\"),1,\"\")","v":""},{"$f":"IF(AND($V$52=$AG$36,AD52=\"\",AE52=\"\",AF52=\"\",AC52=\"\",AB52=\"\",AA52=\"\",Z52=\"\",Y52=\"\",X52=\"\",W52=\"\"),1,\"\")","v":""},{"$f":"IF(AND($V$52=$AH$36,AE52=\"\",AF52=\"\",AG52=\"\",AD52=\"\",AC52=\"\",AB52=\"\",AA52=\"\",Z52=\"\",Y52=\"\",X52=\"\",W52=\"\"),1,\"\")","v":""},{"$f":"IF(AND($V$52=$AI$36,AF52=\"\",AG52=\"\",AH52=\"\",AE52=\"\",AD52=\"\",AC52=\"\",AB52=\"\",AA52=\"\",Z52=\"\",Y52=\"\",X52=\"\",W52=\"\"),1,\"\")","v":""},{"$f":"IF(AND($V$52=$AJ$36,AG52=\"\",AH52=\"\",AI52=\"\",AF52=\"\",AE52=\"\",AD52=\"\",AC52=\"\",AB52=\"\",AA52=\"\",Z52=\"\",Y52=\"\",X52=\"\",W52=\"\"),1,\"\")","v":""},{"$f":"IF(AND($V$52=$AK$36,AH52=\"\",AI52=\"\",AJ52=\"\",AG52=\"\",AF52=\"\",AE52=\"\",AD52=\"\",AC52=\"\",AB52=\"\",AA52=\"\",Z52=\"\",Y52=\"\",X52=\"\",W52=\"\"),1,\"\")","v":""},null,null,null,null,null,null,null,null,null,null,null,null,null,null,null,null,null,null,41]
[null,null,null,null,null,null,null,null,null,null,null,null,null,null,null,null,{"$f":"IF(R53=\"\",\"\",IF(ISNA(VLOOKUP(R53,Planning_général!$E$17:$F$62,2,0)),\"\",VLOOKUP(R53,Planning_général!$E$17:$F$62,2,0)))","v":""},{"$f":"IF(W53=1,$W$4,IF(X53=1,$X$4,IF(Y53=1,$Y$4,IF(Z53=1,$Z$4,IF(AA53=1,$AA$4,IF(AB53=1,$AB$4,IF(AC53=1,$AC$4,IF(AD53=1,$AD$4,IF(AE53=1,$AE$4,IF(AF53=1,$AF$4,IF(AG53=1,$AG$4,IF(AH53=1,$AH$4,IF(AI53=1,$AI$4,IF(AJ53=1,$AJ$4,IF(AK53=1,$AK$4,\"\")))))))))))))))","v":""},{"$f":"IF(U53=1,U$10,IF(V53=1,V$10,IF(W53=1,W$10,IF(X53=1,X$10,IF(Y53=1,Y$10,IF(Z53=1,Z$10,IF(AA53=1,AA$10,IF(AB53=1,AB$10,IF(AC53=1,AC$10,IF(AD53=1,AD$10,IF(AE53=1,AE$10,\"\")))))))))))","v":""},null,null,"S.A",null,{"$f":"IF(AND(X$36=$V$53,W53=\"\",X52=\"\"),1,\"\")","v":""},{"$f":"IF(AND(Y$36=$V$53,X53=\"\",Y52=\"\"),1,\"\")","v":""},{"$f":"IF(AND(Z$36=$V$53,Z52=\"\",SUM($X$53:Y53)=0),1,\"\")","v":""},{"$f":"IF(AND(AA$36=$V$53,AA52=\"\",SUM($X$53:Z53)=0),1,\"\")","v":""},{"$f":"IF(AND(AB$36=$V$53,AB52=\"\",SUM($X$53:AA53)=0),1,\"\")","v":""},{"$f":"IF(AND(AC$36=$V$53,AC52=\"\",SUM($X$53:AB53)=0),1,\"\")","v":""},{"$f":"IF(AND(AD$36=$V$53,AD52=\"\",SUM($X$53:AC53)=0),1,\"\")","v":""},{"$f":"IF(AND(AE$36=$V$53,AE52=\"\",SUM($X$53:AD53)=0),1,\"\")","v":""},{"$f":"IF(AND(AF$36=$V$53,AF52=\"\",SUM($X$53:AE53)=0),1,\"\")","v":""},{"$f":"IF(AND(AG$36=$V$53,AG52=\"\",SUM($X$53:AF53)=0),1,\"\")","v":""},{"$f":"IF(AND(AH$36=$V$53,AH52=\"\",SUM($X$53:AG53)=0),1,\"\")","v":""},{"$f":"IF(AND(AI$36=$V$53,AI52=\"\",SUM($X$53:AH53)=0),1,\"\")","v":""},{"$f":"IF(AND(AJ$36=$V$53,AJ52=\"\",SUM($X$53:AI53)=0),1,\"\")","v":""},{"$f":"IF(AND(AK$36=$V$53,AK52=\"\",SUM($X$53:AJ53)=0),1,\"\")","v":""},null,null,null,null,null,null,null,null,null,null,null,null,null,null,null,null,null,null,42]
[null,null,null,null,null,null,null,null,null,null,null,null,null,null,null,null,{"$f":"IF(R54=\"\",\"\",IF(ISNA(VLOOKUP(R54,Planning_général!$E$17:$F$62,2,0)),\"\",VLOOKUP(R54,Planning_général!$E$17:$F$62,2,0)))","v":""},{"$f":"IF(W54=1,$W$4,IF(X54=1,$X$4,IF(Y54=1,$Y$4,IF(Z54=1,$Z$4,IF(AA54=1,$AA$4,IF(AB54=1,$AB$4,IF(AC54=1,$AC$4,IF(AD54=1,$AD$4,IF(AE54=1,$AE$4,IF(AF54=1,$AF$4,IF(AG54=1,$AG$4,IF(AH54=1,$AH$4,IF(AI54=1,$AI$4,IF(AJ54=1,$AJ$4,IF(AK54=1,$AK$4,\"\")))))))))))))))","v":""},"",null,null,"S.D",{"$f":"IF($V$54=$W$36,1,\"\")","v":""},{"$f":"IF(AND($V$54=$X$36,W54=\"\"),1,\"\")","v":""},{"$f":"IF(AND($V$54=$Y$36,X54=\"\",W54=\"\"),1,\"\")","v":""},{"$f":"IF(AND($V$54=Z36,W54=\"\",X54=\"\",Y54=\"\"),1,\"\")","v":""},{"$f":"IF(AND($V$54=$AA$36,X54=\"\",Y54=\"\",Z54=\"\",W54=\"\"),1,\"\")","v":""},{"$f":"IF(AND($V$54=$AB$36,Y54=\"\",Z54=\"\",AA54=\"\",X54=\"\",W54=\"\"),1,\"\")","v":""},{"$f":"IF(AND($V$54=AC36,Z54=\"\",AA54=\"\",AB54=\"\",Y54=\"\",X54=\"\",W54=\"\"),1,\"\")","v":""},{"$f":"IF(AND($V$54=AD36,AA54=\"\",AB54=\"\",AC54=\"\",Z54=\"\",Y54=\"\",X54=\"\",W54=\"\"),1,\"\")","v":""},{"$f":"IF(AND($V$54=$AE$36,AB54=\"\",AC54=\"\",AD54=\"\",AA54=\"\",Z54=\"\",Y54=\"\",X54=\"\",W54=\"\"),1,\"\")","v":""},{"$f":"IF(AND($V$54=$AF$36,AC54=\"\",AD54=\"\",AE54=\"\",AB54=\"\",AA54=\"\",Z54=\"\",Y54=\"\",X54=\"\",W54=\"\"),1,\"\")","v":""},{"$f":"IF(AND($V$54=$AG$36,AD54=\"\",AE54=\"\",AF54=\"\",AC54=\"\",AB54=\"\",AA54=\"\",Z54=\"\",Y54=\"\",X54=\"\",W54=\"\"),1,\"\")","v":""},{"$f":"IF(AND($V$54=$AH$36,AE54=\"\",AF54=\"\",AG54=\"\",AD54=\"\",AC54=\"\",AB54=\"\",AA54=\"\",Z54=\"\",Y54=\"\",X54=\"\",W54=\"\"),1,\"\")","v":""},{"$f":"IF(AND($V$54=$AI$36,AF54=\"\",AG54=\"\",AH54=\"\",AE54=\"\",AD54=\"\",AC54=\"\",AB54=\"\",AA54=\"\",Z54=\"\",Y54=\"\",X54=\"\",W54=\"\"),1,\"\")","v":""},{"$f":"IF(AND($V$54=$AJ$36,AG54=\"\",AH54=\"\",AI54=\"\",AF54=\"\",AE54=\"\",AD54=\"\",AC54=\"\",AB54=\"\",AA54=\"\",Z54=\"\",Y54=\"\",X54=\"\",W54=\"\"),1,\"\")","v":""},{"$f":"IF(AND($V$54=$AK$36,AH54=\"\",AI54=\"\",AJ54=\"\",AG54=\"\",AF54=\"\",AE54=\"\",AD54=\"\",AC54=\"\",AB54=\"\",AA54=\"\",Z54=\"\",Y54=\"\",X54=\"\",W54=\"\"),1,\"\")","v":""},null,null,null,null,null,null,null,null,null,null,null,null,null,null,null,null,null,null,43]
[null,null,null,null,null,null,null,null,null,null,null,null,null,null,null,null,{"$f":"IF(R55=\"\",\"\",IF(ISNA(VLOOKUP(R55,Planning_général!$E$17:$F$62,2,0)),\"\",VLOOKUP(R55,Planning_général!$E$17:$F$62,2,0)))","v":""},{"$f":"IF(W55=1,$W$4,IF(X55=1,$X$4,IF(Y55=1,$Y$4,IF(Z55=1,$Z$4,IF(AA55=1,$AA$4,IF(AB55=1,$AB$4,IF(AC55=1,$AC$4,IF(AD55=1,$AD$4,IF(AE55=1,$AE$4,IF(AF55=1,$AF$4,IF(AG55=1,$AG$4,IF(AH55=1,$AH$4,IF(AI55=1,$AI$4,IF(AJ55=1,$AJ$4,IF(AK55=1,$AK$4,\"\")))))))))))))))","v":""},{"$f":"IF(U55=1,U$10,IF(V55=1,V$10,IF(W55=1,W$10,IF(X55=1,X$10,IF(Y55=1,Y$10,IF(Z55=1,Z$10,IF(AA55=1,AA$10,IF(AB55=1,AB$10,IF(AC55=1,AC$10,IF(AD55=1,AD$10,IF(AE55=1,AE$10,\"\")))))))))))","v":""},null,null,"S.D",null,{"$f":"IF(AND(X$36=$V$55,W55=\"\",X54=\"\"),1,\"\")","v":""},{"$f":"IF(AND(Y$36=$V$55,X55=\"\",Y54=\"\"),1,\"\")","v":""},{"$f":"IF(AND(Z$36=$V$55,Z54=\"\",SUM($X$55:Y55)=0),1,\"\")","v":""},{"$f":"IF(AND(AA$36=$V$55,AA54=\"\",SUM($X$55:Z55)=0),1,\"\")","v":""},{"$f":"IF(AND(AB$36=$V$55,AB54=\"\",SUM($X$55:AA55)=0),1,\"\")","v":""},{"$f":"IF(AND(AC$36=$V$55,AC54=\"\",SUM($X$55:AB55)=0),1,\"\")","v":""},{"$f":"IF(AND(AD$36=$V$55,AD54=\"\",SUM($X$55:AC55)=0),1,\"\")","v":""},{"$f":"IF(AND(AE$36=$V$55,AE54=\"\",SUM($X$55:AD55)=0),1,\"\")","v":""},{"$f":"IF(AND(AF$36=$V$55,AF54=\"\",SUM($X$55:AE55)=0),1,\"\")","v":""},{"$f":"IF(AND(AG$36=$V$55,AG54=\"\",SUM($X$55:AF55)=0),1,\"\")","v":""},{"$f":"IF(AND(AH$36=$V$55,AH54=\"\",SUM($X$55:AG55)=0),1,\"\")","v":""},{"$f":"IF(AND(AI$36=$V$55,AI54=\"\",SUM($X$55:AH55)=0),1,\"\")","v":""},{"$f":"IF(AND(AJ$36=$V$55,AJ54=\"\",SUM($X$55:AI55)=0),1,\"\")","v":""},{"$f":"IF(AND(AK$36=$V$55,AK54=\"\",SUM($X$55:AJ55)=0),1,\"\")","v":""},null,null,null,null,null,null,null,null,null,null,null,null,null,null,null,null,null,null,44]
[]
[null,null,null,null,null,null,null,null,null,null,null,null,null,null,null,null,null,null,null,null,null,null,null,null,null,null,null,null,null,null,null,null,null,null,null,null,null,null,null,null,null,null,null,null,null,null,null,null,null,null,null,null,null,null,null,45]
[null,null,null,null,null,null,null,null,null,null,null,null,null,null,null,null,{"$f":"IF(R58=\"\",\"\",IF(ISNA(VLOOKUP(R58,Planning_général!$E$17:$F$62,2,0)),\"\",VLOOKUP(R58,Planning_général!$E$17:$F$62,2,0)))","v":""},{"$f":"IF(W58=1,$W$4,IF(X58=1,$X$4,IF(Y58=1,$Y$4,IF(Z58=1,$Z$4,IF(AA58=1,$AA$4,IF(AB58=1,$AB$4,IF(AC58=1,$AC$4,IF(AD58=1,$AD$4,IF(AE58=1,$AE$4,IF(AF58=1,$AF$4,IF(AG58=1,$AG$4,IF(AH58=1,$AH$4,IF(AI58=1,$AI$4,IF(AJ58=1,$AJ$4,IF(AK58=1,$AK$4,\"\")))))))))))))))","v":""},{"$f":"IF(U58=1,U$10,IF(V58=1,V$10,IF(W58=1,W$10,IF(X58=1,X$10,IF(Y58=1,Y$10,IF(Z58=1,Z$10,IF(AA58=1,AA$10,IF(AB58=1,AB$10,IF(AC58=1,AC$10,IF(AD58=1,AD$10,IF(AE58=1,AE$10,\"\")))))))))))","v":""},"Nuit",null,"N.A",{"$f":"IF($V$58=$W$36,1,\"\")","v":""},{"$f":"IF(AND($V$58=$X$36,W58=\"\"),1,\"\")","v":""},{"$f":"IF(AND($V$58=$Y$36,X58=\"\",W58=\"\"),1,\"\")","v":""},{"$f":"IF(AND($V$58=Z36,W58=\"\",X58=\"\",Y58=\"\"),1,\"\")","v":""},{"$f":"IF(AND($V$58=$AA$36,X58=\"\",Y58=\"\",Z58=\"\",W58=\"\"),1,\"\")","v":""},{"$f":"IF(AND($V$58=$AB$36,Y58=\"\",Z58=\"\",AA58=\"\",X58=\"\",W58=\"\"),1,\"\")","v":""},{"$f":"IF(AND($V$58=AC36,Z58=\"\",AA58=\"\",AB58=\"\",Y58=\"\",X58=\"\",W58=\"\"),1,\"\")","v":""},{"$f":"IF(AND($V$58=AD36,AA58=\"\",AB58=\"\",AC58=\"\",Z58=\"\",Y58=\"\",X58=\"\",W58=\"\"),1,\"\")","v":""},{"$f":"IF(AND($V$58=$AE$36,AB58=\"\",AC58=\"\",AD58=\"\",AA58=\"\",Z58=\"\",Y58=\"\",X58=\"\",W58=\"\"),1,\"\")","v":""},{"$f":"IF(AND($V$58=$AF$36,AC58=\"\",AD58=\"\",AE58=\"\",AB58=\"\",AA58=\"\",Z58=\"\",Y58=\"\",X58=\"\",W58=\"\"),1,\"\")","v":""},{"$f":"IF(AND($V$58=$AG$36,AD58=\"\",AE58=\"\",AF58=\"\",AC58=\"\",AB58=\"\",AA58=\"\",Z58=\"\",Y58=\"\",X58=\"\",W58=\"\"),1,\"\")","v":""},{"$f":"IF(AND($V$58=$AH$36,AE58=\"\",AF58=\"\",AG58=\"\",AD58=\"\",AC58=\"\",AB58=\"\",AA58=\"\",Z58=\"\",Y58=\"\",X58=\"\",W58=\"\"),1,\"\")","v":""},{"$f":"IF(AND($V$58=$AI$36,AF58=\"\",AG58=\"\",AH58=\"\",AE58=\"\",AD58=\"\",AC58=\"\",AB58=\"\",AA58=\"\",Z58=\"\",Y58=\"\",X58=\"\",W58=\"\"),1,\"\")","v":""},{"$f":"IF(AND($V$58=$AJ$36,AG58=\"\",AH58=\"\",AI58=\"\",AF58=\"\",AE58=\"\",AD58=\"\",AC58=\"\",AB58=\"\",AA58=\"\",Z58=\"\",Y58=\"\",X58=\"\",W58=\"\"),1,\"\")","v":""},{"$f":"IF(AND($V$58=$AK$36,AH58=\"\",AI58=\"\",AJ58=\"\",AG58=\"\",AF58=\"\",AE58=\"\",AD58=\"\",AC58=\"\",AB58=\"\",AA58=\"\",Z58=\"\",Y58=\"\",X58=\"\",W58=\"\"),1,\"\")","v":""},null,null,null,null,null,null,null,null,null,null,null,null,null,null,null,null,null,null,46]
[null,null,null,null,null,null,null,null,null,null,null,null,null,null,null,null,{"$f":"IF(R59=\"\",\"\",IF(ISNA(VLOOKUP(R59,Planning_général!$E$17:$F$62,2,0)),\"\",VLOOKUP(R59,Planning_général!$E$17:$F$62,2,0)))","v":""},{"$f":"IF(W59=1,$W$4,IF(X59=1,$X$4,IF(Y59=1,$Y$4,IF(Z59=1,$Z$4,IF(AA59=1,$AA$4,IF(AB59=1,$AB$4,IF(AC59=1,$AC$4,IF(AD59=1,$AD$4,IF(AE59=1,$AE$4,IF(AF59=1,$AF$4,IF(AG59=1,$AG$4,IF(AH59=1,$AH$4,IF(AI59=1,$AI$4,IF(AJ59=1,$AJ$4,IF(AK59=1,$AK$4,\"\")))))))))))))))","v":""},{"$f":"IF(U59=1,U$10,IF(V59=1,V$10,IF(W59=1,W$10,IF(X59=1,X$10,IF(Y59=1,Y$10,IF(Z59=1,Z$10,IF(AA59=1,AA$10,IF(AB59=1,AB$10,IF(AC59=1,AC$10,IF(AD59=1,AD$10,IF(AE59=1,AE$10,\"\")))))))))))","v":""},null,null,"N.A",null,{"$f":"IF(AND(X$36=$V$59,W59=\"\",X58=\"\"),1,\"\")","v":""},{"$f":"IF(AND(Y$36=$V$59,X59=\"\",Y58=\"\"),1,\"\")","v":""},{"$f":"IF(AND(Z$36=$V$59,Z58=\"\",SUM($X$59:Y59)=0),1,\"\")","v":""},{"$f":"IF(AND(AA$36=$V$59,AA58=\"\",SUM($X$59:Z59)=0),1,\"\")","v":""},{"$f":"IF(AND(AB$36=$V$59,AB58=\"\",SUM($X$59:AA59)=0),1,\"\")","v":""},{"$f":"IF(AND(AC$36=$V$59,AC58=\"\",SUM($X$59:AB59)=0),1,\"\")","v":""},{"$f":"IF(AND(AD$36=$V$59,AD58=\"\",SUM($X$59:AC59)=0),1,\"\")","v":""},{"$f":"IF(AND(AE$36=$V$59,AE58=\"\",SUM($X$59:AD59)=0),1,\"\")","v":""},{"$f":"IF(AND(AF$36=$V$59,AF58=\"\",SUM($X$59:AE59)=0),1,\"\")","v":""},{"$f":"IF(AND(AG$36=$V$59,AG58=\"\",SUM($X$59:AF59)=0),1,\"\")","v":""},{"$f":"IF(AND(AH$36=$V$59,AH58=\"\",SUM($X$59:AG59)=0),1,\"\")","v":""},{"$f":"IF(AND(AI$36=$V$59,AI58=\"\",SUM($X$59:AH59)=0),1,\"\")","v":""},{"$f":"IF(AND(AJ$36=$V$59,AJ58=\"\",SUM($X$59:AI59)=0),1,\"\")","v":""},{"$f":"IF(AND(AK$36=$V$59,AK58=\"\",SUM($X$59:AJ59)=0),1,\"\")","v":""},null,null,null,null,null,null,null,null,null,null,null,null,null,null,null,null,null,null,47]
[null,null,null,null,null,null,null,null,null,null,null,null,null,null,null,null,{"$f":"IF(R60=\"\",\"\",IF(ISNA(VLOOKUP(R60,Planning_général!$E$17:$F$62,2,0)),\"\",VLOOKUP(R60,Planning_général!$E$17:$F$62,2,0)))","v":""},{"$f":"IF(W60=1,$W$4,IF(X60=1,$X$4,IF(Y60=1,$Y$4,IF(Z60=1,$Z$4,IF(AA60=1,$AA$4,IF(AB60=1,$AB$4,IF(AC60=1,$AC$4,IF(AD60=1,$AD$4,IF(AE60=1,$AE$4,IF(AF60=1,$AF$4,IF(AG60=1,$AG$4,IF(AH60=1,$AH$4,IF(AI60=1,$AI$4,IF(AJ60=1,$AJ$4,IF(AK60=1,$AK$4,\"\")))))))))))))))","v":""},"",null,null,"N.D",{"$f":"IF($V$60=$W$36,1,\"\")","v":""},{"$f":"IF(AND($V$60=$X$36,W60=\"\"),1,\"\")","v":""},{"$f":"IF(AND($V$60=$Y$36,X60=\"\",W60=\"\"),1,\"\")","v":""},{"$f":"IF(AND($V$60=Z36,W60=\"\",X60=\"\",Y60=\"\"),1,\"\")","v":""},{"$f":"IF(AND($V$60=$AA$36,X60=\"\",Y60=\"\",Z60=\"\",W60=\"\"),1,\"\")","v":""},{"$f":"IF(AND($V$60=$AB$36,Y60=\"\",Z60=\"\",AA60=\"\",X60=\"\",W60=\"\"),1,\"\")","v":""},{"$f":"IF(AND($V$60=AC36,Z60=\"\",AA60=\"\",AB60=\"\",Y60=\"\",X60=\"\",W60=\"\"),1,\"\")","v":""},{"$f":"IF(AND($V$60=AD36,AA60=\"\",AB60=\"\",AC60=\"\",Z60=\"\",Y60=\"\",X60=\"\",W60=\"\"),1,\"\")","v":""},{"$f":"IF(AND($V$60=$AE$36,AB60=\"\",AC60=\"\",AD60=\"\",AA60=\"\",Z60=\"\",Y60=\"\",X60=\"\",W60=\"\"),1,\"\")","v":""},{"$f":"IF(AND($V$60=$AF$36,AC60=\"\",AD60=\"\",AE60=\"\",AB60=\"\",AA60=\"\",Z60=\"\",Y60=\"\",X60=\"\",W60=\"\"),1,\"\")","v":""},{"$f":"IF(AND($V$60=$AG$36,AD60=\"\",AE60=\"\",AF60=\"\",AC60=\"\",AB60=\"\",AA60=\"\",Z60=\"\",Y60=\"\",X60=\"\",W60=\"\"),1,\"\")","v":""},{"$f":"IF(AND($V$60=$AH$36,AE60=\"\",AF60=\"\",AG60=\"\",AD60=\"\",AC60=\"\",AB60=\"\",AA60=\"\",Z60=\"\",Y60=\"\",X60=\"\",W60=\"\"),1,\"\")","v":""},{"$f":"IF(AND($V$60=$AI$36,AF60=\"\",AG60=\"\",AH60=\"\",AE60=\"\",AD60=\"\",AC60=\"\",AB60=\"\",AA60=\"\",Z60=\"\",Y60=\"\",X60=\"\",W60=\"\"),1,\"\")","v":""},{"$f":"IF(AND($V$60=$AJ$36,AG60=\"\",AH60=\"\",AI60=\"\",AF60=\"\",AE60=\"\",AD60=\"\",AC60=\"\",AB60=\"\",AA60=\"\",Z60=\"\",Y60=\"\",X60=\"\",W60=\"\"),1,\"\")","v":""},{"$f":"IF(AND($V$60=$AK$36,AH60=\"\",AI60=\"\",AJ60=\"\",AG60=\"\",AF60=\"\",AE60=\"\",AD60=\"\",AC60=\"\",AB60=\"\",AA60=\"\",Z60=\"\",Y60=\"\",X60=\"\",W60=\"\"),1,\"\")","v":""},null,null,null,null,null,null,null,null,null,null,null,null,null,null,null,null,null,null,48]
[null,null,null,null,null,null,null,null,null,null,null,null,null,null,null,null,{"$f":"IF(R61=\"\",\"\",IF(ISNA(VLOOKUP(R61,Planning_général!$E$17:$F$62,2,0)),\"\",VLOOKUP(R61,Planning_général!$E$17:$F$62,2,0)))","v":""},{"$f":"IF(W61=1,$W$4,IF(X61=1,$X$4,IF(Y61=1,$Y$4,IF(Z61=1,$Z$4,IF(AA61=1,$AA$4,IF(AB61=1,$AB$4,IF(AC61=1,$AC$4,IF(AD61=1,$AD$4,IF(AE61=1,$AE$4,IF(AF61=1,$AF$4,IF(AG61=1,$AG$4,IF(AH61=1,$AH$4,IF(AI61=1,$AI$4,IF(AJ61=1,$AJ$4,IF(AK61=1,$AK$4,\"\")))))))))))))))","v":""},{"$f":"IF(U61=1,U$10,IF(V61=1,V$10,IF(W61=1,W$10,IF(X61=1,X$10,IF(Y61=1,Y$10,IF(Z61=1,Z$10,IF(AA61=1,AA$10,IF(AB61=1,AB$10,IF(AC61=1,AC$10,IF(AD61=1,AD$10,IF(AE61=1,AE$10,\"\")))))))))))","v":""},null,null,"N.D",null,{"$f":"IF(AND(X$36=$V$61,W61=\"\",X60=\"\"),1,\"\")","v":""},{"$f":"IF(AND(Y$36=$V$61,X61=\"\",Y60=\"\"),1,\"\")","v":""},{"$f":"IF(AND(Z$36=$V$61,Z60=\"\",SUM($X$61:Y61)=0),1,\"\")","v":""},{"$f":"IF(AND(AA$36=$V$61,AA60=\"\",SUM($X$61:Z61)=0),1,\"\")","v":""},{"$f":"IF(AND(AB$36=$V$61,AB60=\"\",SUM($X$61:AA61)=0),1,\"\")","v":""},{"$f":"IF(AND(AC$36=$V$61,AC60=\"\",SUM($X$61:AB61)=0),1,\"\")","v":""},{"$f":"IF(AND(AD$36=$V$61,AD60=\"\",SUM($X$61:AC61)=0),1,\"\")","v":""},{"$f":"IF(AND(AE$36=$V$61,AE60=\"\",SUM($X$61:AD61)=0),1,\"\")","v":""},{"$f":"IF(AND(AF$36=$V$61,AF60=\"\",SUM($X$61:AE61)=0),1,\"\")","v":""},{"$f":"IF(AND(AG$36=$V$61,AG60=\"\",SUM($X$61:AF61)=0),1,\"\")","v":""},{"$f":"IF(AND(AH$36=$V$61,AH60=\"\",SUM($X$61:AG61)=0),1,\"\")","v":""},{"$f":"IF(AND(AI$36=$V$61,AI60=\"\",SUM($X$61:AH61)=0),1,\"\")","v":""},{"$f":"IF(AND(AJ$36=$V$61,AJ60=\"\",SUM($X$61:AI61)=0),1,\"\")","v":""},{"$f":"IF(AND(AK$36=$V$61,AK60=\"\",SUM($X$61:AJ61)=0),1,\"\")","v":""}]
[]
[null,null,null,null,null,null,null,null,null,null,null,null,null,null,null,null,null,null,null,null,null,null,null,null,null,null,null,null,null,null,null,null,null,null,null,null,null,null,null,null,null,null,null,null,null,null,null,null,null,null,null,null,null,null,null,49]
[null,null,null,null,null,null,null,null,null,null,null,null,null,null,null,null,null,null,null,null,null,null,{"$f":"IF(W33=0,\"\",IF(W21=W33,$V$21,IF(W22=W33,$V$22,IF(W23=W33,$V$23,IF(W24=W33,$V$24,IF(W25=W33,$V$25,IF(W26=W33,$V$26,IF(W27=W33,$V$27,IF(W28=W33,$V$28,IF(W29=W33,$V$29,IF(W30=W33,$V$30,IF(W31=W33,$V$31,\"\"))))))))))))","v":""},"","","","","","","","","","","","","","",null,null,null,null,null,null,null,null,null,null,null,null,null,null,null,null,null,null,50]
[null,null,null,null,null,null,null,null,null,null,null,null,null,null,null,null,{"$f":"IF(R65=\"\",\"\",IF(ISNA(VLOOKUP(R65,Planning_général!$E$17:$F$62,2,0)),\"\",VLOOKUP(R65,Planning_général!$E$17:$F$62,2,0)))","v":""},{"$f":"IF(W65=1,$W$4,IF(X65=1,$X$4,IF(Y65=1,$Y$4,IF(Z65=1,$Z$4,IF(AA65=1,$AA$4,IF(AB65=1,$AB$4,IF(AC65=1,$AC$4,IF(AD65=1,$AD$4,IF(AE65=1,$AE$4,IF(AF65=1,$AF$4,IF(AG65=1,$AG$4,IF(AH65=1,$AH$4,IF(AI65=1,$AI$4,IF(AJ65=1,$AJ$4,IF(AK65=1,$AK$4,\"\")))))))))))))))","v":""},{"$f":"IF(U65=1,U$10,IF(V65=1,V$10,IF(W65=1,W$10,IF(X65=1,X$10,IF(Y65=1,Y$10,IF(Z65=1,Z$10,IF(AA65=1,AA$10,IF(AB65=1,AB$10,IF(AC65=1,AC$10,IF(AD65=1,AD$10,IF(AE65=1,AE$10,\"\")))))))))))","v":""},"Samedi matin",null,"SM.A",{"$f":"IF($V$65=$W$64,1,\"\")","v":""},{"$f":"IF(AND($V$65=$X$64,W65=\"\"),1,\"\")","v":""},{"$f":"IF(AND($V$65=$Y$64,X65=\"\",W65=\"\"),1,\"\")","v":""},{"$f":"IF(AND($V$65=Z64,W65=\"\",X65=\"\",Y65=\"\"),1,\"\")","v":""},{"$f":"IF(AND($V$65=$AA$64,X65=\"\",Y65=\"\",Z65=\"\",W65=\"\"),1,\"\")","v":""},{"$f":"IF(AND($V$65=$AB$64,Y65=\"\",Z65=\"\",AA65=\"\",X65=\"\",W65=\"\"),1,\"\")","v":""},{"$f":"IF(AND($V$65=AC64,Z65=\"\",AA65=\"\",AB65=\"\",Y65=\"\",X65=\"\",W65=\"\"),1,\"\")","v":""},{"$f":"IF(AND($V$65=AD64,AA65=\"\",AB65=\"\",AC65=\"\",Z65=\"\",Y65=\"\",X65=\"\",W65=\"\"),1,\"\")","v":""},{"$f":"IF(AND($V$65=$AE$64,AB65=\"\",AC65=\"\",AD65=\"\",AA65=\"\",Z65=\"\",Y65=\"\",X65=\"\",W65=\"\"),1,\"\")","v":""},{"$f":"IF(AND($V$65=$AF$64,AC65=\"\",AD65=\"\",AE65=\"\",AB65=\"\",AA65=\"\",Z65=\"\",Y65=\"\",X65=\"\",W65=\"\"),1,\"\")","v":""},{"$f":"IF(AND($V$65=$AG$64,AD65=\"\",AE65=\"\",AF65=\"\",AC65=\"\",AB65=\"\",AA65=\"\",Z65=\"\",Y65=\"\",X65=\"\",W65=\"\"),1,\"\")","v":""},{"$f":"IF(AND($V$65=$AH$64,AE65=\"\",AF65=\"\",AG65=\"\",AD65=\"\",AC65=\"\",AB65=\"\",AA65=\"\",Z65=\"\",Y65=\"\",X65=\"\",W65=\"\"),1,\"\")","v":""},{"$f":"IF(AND($V$65=$AI$64,AF65=\"\",AG65=\"\",AH65=\"\",AE65=\"\",AD65=\"\",AC65=\"\",AB65=\"\",AA65=\"\",Z65=\"\",Y65=\"\",X65=\"\",W65=\"\"),1,\"\")","v":""},{"$f":"IF(AND($V$65=$AJ$64,AG65=\"\",AH65=\"\",AI65=\"\",AF65=\"\",AE65=\"\",AD65=\"\",AC65=\"\",AB65=\"\",AA65=\"\",Z65=\"\",Y65=\"\",X65=\"\",W65=\"\"),1,\"\")","v":""},{"$f":"IF(AND($V$65=$AK$64,AH65=\"\",AI65=\"\",AJ65=\"\",AG65=\"\",AF65=\"\",AE65=\"\",AD65=\"\",AC65=\"\",AB65=\"\",AA65=\"\",Z65=\"\",Y65=\"\",X65=\"\",W65=\"\"),1,\"\")","v":""},null,null,null,null,null,null,null,null,null,null,null,null,null,null,null,null,null,null,51]
[null,null,null,null,null,null,null,null,null,null,null,null,null,null,null,null,{"$f":"IF(R66=\"\",\"\",IF(ISNA(VLOOKUP(R66,Planning_général!$E$17:$F$62,2,0)),\"\",VLOOKUP(R66,Planning_général!$E$17:$F$62,2,0)))","v":""},{"$f":"IF(W66=1,$W$4,IF(X66=1,$X$4,IF(Y66=1,$Y$4,IF(Z66=1,$Z$4,IF(AA66=1,$AA$4,IF(AB66=1,$AB$4,IF(AC66=1,$AC$4,IF(AD66=1,$AD$4,IF(AE66=1,$AE$4,IF(AF66=1,$AF$4,IF(AG66=1,$AG$4,IF(AH66=1,$AH$4,IF(AI66=1,$AI$4,IF(AJ66=1,$AJ$4,IF(AK66=1,$AK$4,\"\")))))))))))))))","v":""},{"$f":"IF(U66=1,U$10,IF(V66=1,V$10,IF(W66=1,W$10,IF(X66=1,X$10,IF(Y66=1,Y$10,IF(Z66=1,Z$10,IF(AA66=1,AA$10,IF(AB66=1,AB$10,IF(AC66=1,AC$10,IF(AD66=1,AD$10,IF(AE66=1,AE$10,\"\")))))))))))","v":""},null,null,"SM.A",null,{"$f":"IF(AND(X$64=$V$66,W66=\"\",X65=\"\"),1,\"\")","v":""},{"$f":"IF(AND(Y$64=$V$66,X66=\"\",Y65=\"\"),1,\"\")","v":""},{"$f":"IF(AND(Z$64=$V$66,Z65=\"\",SUM($X$66:Y66)=0),1,\"\")","v":""},{"$f":"IF(AND(AA$64=$V$66,AA65=\"\",SUM($X$66:Z66)=0),1,\"\")","v":""},{"$f":"IF(AND(AB$64=$V$66,AB65=\"\",SUM($X$66:AA66)=0),1,\"\")","v":""},{"$f":"IF(AND(AC$64=$V$66,AC65=\"\",SUM($X$66:AB66)=0),1,\"\")","v":""},{"$f":"IF(AND(AD$64=$V$66,AD65=\"\",SUM($X$66:AC66)=0),1,\"\")","v":""},{"$f":"IF(AND(AE$64=$V$66,AE65=\"\",SUM($X$66:AD66)=0),1,\"\")","v":""},{"$f":"IF(AND(AF$64=$V$66,AF65=\"\",SUM($X$66:AE66)=0),1,\"\")","v":""},{"$f":"IF(AND(AG$64=$V$66,AG65=\"\",SUM($X$66:AF66)=0),1,\"\")","v":""},{"$f":"IF(AND(AH$64=$V$66,AH65=\"\",SUM($X$66:AG66)=0),1,\"\")","v":""},{"$f":"IF(AND(AI$64=$V$66,AI65=\"\",SUM($X$66:AH66)=0),1,\"\")","v":""},{"$f":"IF(AND(AJ$64=$V$66,AJ65=\"\",SUM($X$66:AI66)=0),1,\"\")","v":""},{"$f":"IF(AND(AK$64=$V$66,AK65=\"\",SUM($X$66:AJ66)=0),1,\"\")","v":""},null,null,null,null,null,null,null,null,null,null,null,null,null,null,null,null,null,null,52]
[null,null,null,null,null,null,null,null,null,null,null,null,null,null,null,null,{"$f":"IF(R67=\"\",\"\",IF(ISNA(VLOOKUP(R67,Planning_général!$E$17:$F$62,2,0)),\"\",VLOOKUP(R67,Planning_général!$E$17:$F$62,2,0)))","v":""},{"$f":"IF(W67=1,$W$4,IF(X67=1,$X$4,IF(Y67=1,$Y$4,IF(Z67=1,$Z$4,IF(AA67=1,$AA$4,IF(AB67=1,$AB$4,IF(AC67=1,$AC$4,IF(AD67=1,$AD$4,IF(AE67=1,$AE$4,IF(AF67=1,$AF$4,IF(AG67=1,$AG$4,IF(AH67=1,$AH$4,IF(AI67=1,$AI$4,IF(AJ67=1,$AJ$4,IF(AK67=1,$AK$4,\"\")))))))))))))))","v":""},{"$f":"IF(U67=1,U$10,IF(V67=1,V$10,IF(W67=1,W$10,IF(X67=1,X$10,IF(Y67=1,Y$10,IF(Z67=1,Z$10,IF(AA67=1,AA$10,IF(AB67=1,AB$10,IF(AC67=1,AC$10,IF(AD67=1,AD$10,IF(AE67=1,AE$10,\"\")))))))))))","v":""},null,null,"SM.D",{"$f":"IF($V$67=$W$64,1,\"\")","v":""},{"$f":"IF(AND($V$67=$X$64,W67=\"\"),1,\"\")","v":""},{"$f":"IF(AND($V$67=$Y$64,X67=\"\",W67=\"\"),1,\"\")","v":""},{"$f":"IF(AND($V$67=Z66,W67=\"\",X67=\"\",Y67=\"\"),1,\"\")","v":""},{"$f":"IF(AND($V$67=$AA$64,X67=\"\",Y67=\"\",Z67=\"\",W67=\"\"),1,\"\")","v":""},{"$f":"IF(AND($V$67=$AB$64,Y67=\"\",Z67=\"\",AA67=\"\",X67=\"\",W67=\"\"),1,\"\")","v":""},{"$f":"IF(AND($V$67=AC64,Z67=\"\",AA67=\"\",AB67=\"\",Y67=\"\",X67=\"\",W67=\"\"),1,\"\")","v":""},{"$f":"IF(AND($V$67=AD64,AA67=\"\",AB67=\"\",AC67=\"\",Z67=\"\",Y67=\"\",X67=\"\",W67=\"\"),1,\"\")","v":""},{"$f":"IF(AND($V$67=$AE$64,AB67=\"\",AC67=\"\",AD67=\"\",AA67=\"\",Z67=\"\",Y67=\"\",X67=\"\",W67=\"\"),1,\"\")","v":""},{"$f":"IF(AND($V$67=$AF$64,AC67=\"\",AD67=\"\",AE67=\"\",AB67=\"\",AA67=\"\",Z67=\"\",Y67=\"\",X67=\"\",W67=\"\"),1,\"\")","v":""},{"$f":"IF(AND($V$67=$AG$64,AD67=\"\",AE67=\"\",AF67=\"\",AC67=\"\",AB67=\"\",AA67=\"\",Z67=\"\",Y67=\"\",X67=\"\",W67=\"\"),1,\"\")","v":""},{"$f":"IF(AND($V$67=$AH$64,AE67=\"\",AF67=\"\",AG67=\"\",AD67=\"\",AC67=\"\",AB67=\"\",AA67=\"\",Z67=\"\",Y67=\"\",X67=\"\",W67=\"\"),1,\"\")","v":""},{"$f":"IF(AND($V$67=$AI$64,AF67=\"\",AG67=\"\",AH67=\"\",AE67=\"\",AD67=\"\",AC67=\"\",AB67=\"\",AA67=\"\",Z67=\"\",Y67=\"\",X67=\"\",W67=\"\"),1,\"\")","v":""},{"$f":"IF(AND($V$67=$AJ$64,AG67=\"\",AH67=\"\",AI67=\"\",AF67=\"\",AE67=\"\",AD67=\"\",AC67=\"\",AB67=\"\",AA67=\"\",Z67=\"\",Y67=\"\",X67=\"\",W67=\"\"),1,\"\")","v":""},{"$f":"IF(AND($V$67=$AK$64,AH67=\"\",AI67=\"\",AJ67=\"\",AG67=\"\",AF67=\"\",AE67=\"\",AD67=\"\",AC67=\"\",AB67=\"\",AA67=\"\",Z67=\"\",Y67=\"\",X67=\"\",W67=\"\"),1,\"\")","v":""},null,null,null,null,null,null,null,null,null,null,null,null,null,null,null,null,null,null,53]
[null,null,null,null,null,null,null,null,null,null,null,null,null,null,null,null,{"$f":"IF(R68=\"\",\"\",IF(ISNA(VLOOKUP(R68,Planning_général!$E$17:$F$62,2,0)),\"\",VLOOKUP(R68,Planning_général!$E$17:$F$62,2,0)))","v":""},{"$f":"IF(W68=1,$W$4,IF(X68=1,$X$4,IF(Y68=1,$Y$4,IF(Z68=1,$Z$4,IF(AA68=1,$AA$4,IF(AB68=1,$AB$4,IF(AC68=1,$AC$4,IF(AD68=1,$AD$4,IF(AE68=1,$AE$4,IF(AF68=1,$AF$4,IF(AG68=1,$AG$4,IF(AH68=1,$AH$4,IF(AI68=1,$AI$4,IF(AJ68=1,$AJ$4,IF(AK68=1,$AK$4,\"\")))))))))))))))","v":""},{"$f":"IF(U68=1,U$10,IF(V68=1,V$10,IF(W68=1,W$10,IF(X68=1,X$10,IF(Y68=1,Y$10,IF(Z68=1,Z$10,IF(AA68=1,AA$10,IF(AB68=1,AB$10,IF(AC68=1,AC$10,IF(AD68=1,AD$10,IF(AE68=1,AE$10,\"\")))))))))))","v":""},null,null,"SM.D",null,{"$f":"IF(AND(X$64=$V$68,W68=\"\",X67=\"\"),1,\"\")","v":""},{"$f":"IF(AND(Y$64=$V$68,X68=\"\",Y67=\"\"),1,\"\")","v":""},{"$f":"IF(AND(Z$64=$V$68,Z67=\"\",SUM($X$68:Y68)=0),1,\"\")","v":""},{"$f":"IF(AND(AA$64=$V$68,AA67=\"\",SUM($X$68:Z68)=0),1,\"\")","v":""},{"$f":"IF(AND(AB$64=$V$68,AB67=\"\",SUM($X$68:AA68)=0),1,\"\")","v":""},{"$f":"IF(AND(AC$64=$V$68,AC67=\"\",SUM($X$68:AB68)=0),1,\"\")","v":""},{"$f":"IF(AND(AD$64=$V$68,AD67=\"\",SUM($X$68:AC68)=0),1,\"\")","v":""},{"$f":"IF(AND(AE$64=$V$68,AE67=\"\",SUM($X$68:AD68)=0),1,\"\")","v":""},{"$f":"IF(AND(AF$64=$V$68,AF67=\"\",SUM($X$68:AE68)=0),1,\"\")","v":""},{"$f":"IF(AND(AG$64=$V$68,AG67=\"\",SUM($X$68:AF68)=0),1,\"\")","v":""},{"$f":"IF(AND(AH$64=$V$68,AH67=\"\",SUM($X$68:AG68)=0),1,\"\")","v":""},{"$f":"IF(AND(AI$64=$V$68,AI67=\"\",SUM($X$68:AH68)=0),1,\"\")","v":""},{"$f":"IF(AND(AJ$64=$V$68,AJ67=\"\",SUM($X$68:AI68)=0),1,\"\")","v":""},{"$f":"IF(AND(AK$64=$V$68,AK67=\"\",SUM($X$68:AJ68)=0),1,\"\")","v":""}]
[]
[]
[]
[]
[null,null,null,null,null,null,null,null,null,null,null,null,null,null,{"$f":"V73","v":"Mardi"},{"$f":"LEN(Q73)","v":0},{"$f":"(CONCATENATE(IF(W73=1,CONCATENATE(\"-\",W$4,\"(\",W11,\")\"),\"\"),IF(X73=1,CONCATENATE(\"-\",X$4,\"(\",X11,\")\"),\"\"),IF(Y73=1,CONCATENATE(\"-\",Y$4,\"(\",Y11,\")\"),\"\"),IF(Z73=1,CONCATENATE(\"-\",Z$4,\"(\",Z11,\")\"),\"\"),IF(AA73=1,CONCATENATE(\"-\",AA$4,\"(\",AA11,\")\"),\"\"),IF(AB73=1,CONCATENATE(\"-\",AB$4,\"(\",AB11,\")\"),\"\"),IF(AC73=1,CONCATENATE(\"-\",AC$4,\"(\",AC11,\")\"),\"\"),IF(AD73=1,CONCATENATE(\"-\",AD$4,\"(\",AD11,\")\"),\"\"),IF(AE73=1,CONCATENATE(\"-\",AE$4,\"(\",AE11,\")\"),\"\"),IF(AF73=1,CONCATENATE(\"-\",AF$4,\"(\",AF11,\")\"),\"\"),IF(AG73=1,CONCATENATE(\"-\",AG$4,\"(\",AG11,\")\"),\"\"),IF(AH73=1,CONCATENATE(\"-\",AH$4,\"(\",AH11,\")\"),\"\"),IF(AI73=1,CONCATENATE(\"-\",AI$4,\"(\",AI11,\")\"),\"\"),IF(AJ73=1,CONCATENATE(\"-\",AJ$4,\"(\",AJ11,\")\"),\"\"),IF(AK73=1,CONCATENATE(\"-\",AK$4,\"(\",AK11,\")\"),\"\")))","v":""},null,null,null,null,{"$f":"V11","v":"Mardi"},{"$f":"IF((COUNTIF(W11,$AM$73)+COUNTIF(W11,$AM$74)+COUNTIF(W11,$AM$75)+COUNTIF(W11,$AM$76)+COUNTIF(W11,$AM$77)+COUNTIF(W11,$AM$78)+COUNTIF(W11,$AM$79)+COUNTIF(W11,$AM$80)+COUNTIF(W11,$AM$81)+COUNTIF(W11,$AM$82)+COUNTIF(W11,$AM$83))=0,\"\",COUNTIF(W11,$AM$73)+COUNTIF(W11,$AM$74)+COUNTIF(W11,$AM$75)+COUNTIF(W11,$AM$76)+COUNTIF(W11,$AM$77)+COUNTIF(W11,$AM$78)+COUNTIF(W11,$AM$79)+COUNTIF(W11,$AM$80)+COUNTIF(W11,$AM$81)+COUNTIF(W11,$AM$82)+COUNTIF(W11,$AM$83))","v":""},"","","","","","","","","","","","","","",null,"CP"]
[null,null,null,null,null,null,null,null,null,null,null,null,null,null,{"$f":"V74","v":"Mercredi"},{"$f":"LEN(Q74)","v":0},"",null,null,null,null,"Mercredi",{"$f":"IF((COUNTIF(W12,$AM$73)+COUNTIF(W12,$AM$74)+COUNTIF(W12,$AM$75)+COUNTIF(W12,$AM$76)+COUNTIF(W12,$AM$77)+COUNTIF(W12,$AM$78)+COUNTIF(W12,$AM$79)+COUNTIF(W12,$AM$80)+COUNTIF(W12,$AM$81)+COUNTIF(W12,$AM$82)+COUNTIF(W12,$AM$83))=0,\"\",COUNTIF(W12,$AM$73)+COUNTIF(W12,$AM$74)+COUNTIF(W12,$AM$75)+COUNTIF(W12,$AM$76)+COUNTIF(W12,$AM$77)+COUNTIF(W12,$AM$78)+COUNTIF(W12,$AM$79)+COUNTIF(W12,$AM$80)+COUNTIF(W12,$AM$81)+COUNTIF(W12,$AM$82)+COUNTIF(W12,$AM$83))","v":""},"","","","","","","","","","","","","",{"$f":"IF((COUNTIF(AK12,$AM$73)+COUNTIF(AK12,$AM$74)+COUNTIF(AK12,$AM$75)+COUNTIF(AK12,$AM$76)+COUNTIF(AK12,$AM$77)+COUNTIF(AK12,$AM$78)+COUNTIF(AK12,$AM$79)+COUNTIF(AK12,$AM$80)+COUNTIF(AK12,$AM$81)+COUNTIF(AK12,$AM$82))=0,\"\",COUNTIF(AK12,$AM$73)+COUNTIF(AK12,$AM$74)+COUNTIF(AK12,$AM$75)+COUNTIF(AK12,$AM$76)+COUNTIF(AK12,$AM$77)+COUNTIF(AK12,$AM$78)+COUNTIF(AK12,$AM$79)+COUNTIF(AK12,$AM$80)+COUNTIF(AK12,$AM$81)+COUNTIF(AK12,$AM$82))","v":""},null,"Recup"]
[null,null,null,null,null,null,null,null,null,null,null,null,null,null,"Jeudi",0,"",null,null,null,null,"Jeudi","","","","","","","","","","","","","","",{"$f":"IF((COUNTIF(AK13,$AM$73)+COUNTIF(AK13,$AM$74)+COUNTIF(AK13,$AM$75)+COUNTIF(AK13,$AM$76)+COUNTIF(AK13,$AM$77)+COUNTIF(AK13,$AM$78)+COUNTIF(AK13,$AM$79)+COUNTIF(AK13,$AM$80)+COUNTIF(AK13,$AM$81)+COUNTIF(AK13,$AM$82))=0,\"\",COUNTIF(AK13,$AM$73)+COUNTIF(AK13,$AM$74)+COUNTIF(AK13,$AM$75)+COUNTIF(AK13,$AM$76)+COUNTIF(AK13,$AM$77)+COUNTIF(AK13,$AM$78)+COUNTIF(AK13,$AM$79)+COUNTIF(AK13,$AM$80)+COUNTIF(AK13,$AM$81)+COUNTIF(AK13,$AM$82))","v":""},null,"Form"]
[null,null,null,null,null,null,null,null,null,null,null,null,null,null,"Vendredi",0,"",null,null,null,null,"Vendredi","","","","","","","","","","","","","","",{"$f":"IF((COUNTIF(AK14,$AM$73)+COUNTIF(AK14,$AM$74)+COUNTIF(AK14,$AM$75)+COUNTIF(AK14,$AM$76)+COUNTIF(AK14,$AM$77)+COUNTIF(AK14,$AM$78)+COUNTIF(AK14,$AM$79)+COUNTIF(AK14,$AM$80)+COUNTIF(AK14,$AM$81)+COUNTIF(AK14,$AM$82))=0,\"\",COUNTIF(AK14,$AM$73)+COUNTIF(AK14,$AM$74)+COUNTIF(AK14,$AM$75)+COUNTIF(AK14,$AM$76)+COUNTIF(AK14,$AM$77)+COUNTIF(AK14,$AM$78)+COUNTIF(AK14,$AM$79)+COUNTIF(AK14,$AM$80)+COUNTIF(AK14,$AM$81)+COUNTIF(AK14,$AM$82))","v":""},null,"Modul"]
[null,null,null,null,null,null,null,null,null,null,null,null,null,null,"Samedi",0,"",null,null,null,null,"Samedi","","","","","","","","","","","","","","",{"$f":"IF((COUNTIF(AK15,$AM$73)+COUNTIF(AK15,$AM$74)+COUNTIF(AK15,$AM$75)+COUNTIF(AK15,$AM$76)+COUNTIF(AK15,$AM$77)+COUNTIF(AK15,$AM$78)+COUNTIF(AK15,$AM$79)+COUNTIF(AK15,$AM$80)+COUNTIF(AK15,$AM$81)+COUNTIF(AK15,$AM$82))=0,\"\",COUNTIF(AK15,$AM$73)+COUNTIF(AK15,$AM$74)+COUNTIF(AK15,$AM$75)+COUNTIF(AK15,$AM$76)+COUNTIF(AK15,$AM$77)+COUNTIF(AK15,$AM$78)+COUNTIF(AK15,$AM$79)+COUNTIF(AK15,$AM$80)+COUNTIF(AK15,$AM$81)+COUNTIF(AK15,$AM$82))","v":""},null,"H.R"]
[null,null,null,null,null,null,null,null,null,null,null,null,null,null,"Dimanche",0,"",null,null,null,null,"Dimanche","","","","","","","","","","","","","","",{"$f":"IF((COUNTIF(AK16,$AM$73)+COUNTIF(AK16,$AM$74)+COUNTIF(AK16,$AM$75)+COUNTIF(AK16,$AM$76)+COUNTIF(AK16,$AM$77)+COUNTIF(AK16,$AM$78)+COUNTIF(AK16,$AM$79)+COUNTIF(AK16,$AM$80)+COUNTIF(AK16,$AM$81)+COUNTIF(AK16,$AM$82))=0,\"\",COUNTIF(AK16,$AM$73)+COUNTIF(AK16,$AM$74)+COUNTIF(AK16,$AM$75)+COUNTIF(AK16,$AM$76)+COUNTIF(AK16,$AM$77)+COUNTIF(AK16,$AM$78)+COUNTIF(AK16,$AM$79)+COUNTIF(AK16,$AM$80)+COUNTIF(AK16,$AM$81)+COUNTIF(AK16,$AM$82))","v":""},null,"HR Nuit"]
[null,null,null,null,null,null,null,null,null,null,null,null,null,null,"Lundi",0,"",null,null,null,null,"Lundi","","","","","","","","","","","","","","",{"$f":"IF((COUNTIF(AK17,$AM$73)+COUNTIF(AK17,$AM$74)+COUNTIF(AK17,$AM$75)+COUNTIF(AK17,$AM$76)+COUNTIF(AK17,$AM$77)+COUNTIF(AK17,$AM$78)+COUNTIF(AK17,$AM$79)+COUNTIF(AK17,$AM$80)+COUNTIF(AK17,$AM$81)+COUNTIF(AK17,$AM$82))=0,\"\",COUNTIF(AK17,$AM$73)+COUNTIF(AK17,$AM$74)+COUNTIF(AK17,$AM$75)+COUNTIF(AK17,$AM$76)+COUNTIF(AK17,$AM$77)+COUNTIF(AK17,$AM$78)+COUNTIF(AK17,$AM$79)+COUNTIF(AK17,$AM$80)+COUNTIF(AK17,$AM$81)+COUNTIF(AK17,$AM$82))","v":""},null,"RTT"]
[null,null,null,null,null,null,null,null,null,null,null,null,null,null,null,null,null,null,null,null,null,null,null,null,null,null,null,null,null,null,null,null,null,null,null,null,null,null,"Mal"]
[null,null,null,null,null,null,null,null,null,null,null,null,null,null,null,null,null,null,null,null,null,null,null,null,null,null,null,null,null,null,null,null,null,null,null,null,null,null,"J.A"]
[null,null,null,null,null,null,null,null,null,null,null,null,null,null,null,null,null,null,null,null,null,null,null,null,null,null,null,null,null,null,null,null,null,null,null,null,null,null,"Ecole"]
[null,null,null,null,null,null,null,null,null,null,null,null,null,null,null,null,null,null,null,null,null,null,null,null,null,null,null,null,null,null,null,null,null,null,null,null,null,null,"Dep"]

{"sheet":"Magasin","index":5,"n_rows":81,"n_cols":56,"rows_kept":81,"cut":false,"hidden":false,"merged":[[10,4,11,5],[8,3,9,3],[14,3,15,3],[8,6,9,7],[14,6,15,7],[22,5,22,11],[10,3,11,3],[12,3,13,3],[6,3,7,3],[6,4,7,5],[6,6,7,7],[6,8,6,10],[7,8,7,10],[8,8,8,10],[9,8,9,10],[14,8,14,10],[15,8,15,10],[17,5,17,11],[18,5,18,11],[19,5,19,11],[20,5,20,11],[21,5,21,11],[11,8,11,10],[10,8,10,10],[10,6,11,7],[2,4,2,5],[2,6,2,7],[4,6,5,7],[4,8,4,10],[5,8,5,10],[28,17,29,18],[30,17,30,18],[30,19,32,19],[31,17,31,18],[32,17,32,18],[12,4,13,5],[12,6,13,7],[12,8,12,10],[13,8,13,10],[3,1,3,11],[4,3,5,3],[4,4,5,5],[2,1,2,3],[2,8,2,10],[4,1,7,2],[8,1,15,2],[17,1,22,3],[8,4,9,5],[14,4,15,5],[51,17,51,18],[54,17,54,18],[54,19,56,19],[55,17,55,18],[56,17,56,18],[59,17,59,18],[59,19,61,19],[60,17,60,18],[34,17,34,18],[34,19,36,19],[35,17,35,18],[36,17,36,18],[39,17,39,18],[39,19,41,19],[40,17,40,18],[41,17,41,18],[14,40,15,40],[14,41,15,41],[14,42,15,42],[14,43,15,43],[77,16,77,18],[64,17,64,18],[64,19,66,19],[65,17,65,18],[66,17,66,18],[70,16,70,18],[71,16,71,18],[72,16,72,18],[73,16,73,18],[74,16,74,18],[75,16,75,18],[76,16,76,18],[61,17,61,18],[44,17,44,18],[44,19,46,19],[45,17,45,18],[46,17,46,18],[49,17,49,18],[49,19,51,19],[50,17,50,18],[2,22,7,22],[2,23,7,23],[2,24,7,24],[2,36,7,36],[2,25,7,25],[2,26,7,26],[2,27,7,27],[2,28,7,28],[2,29,7,29],[2,30,7,30],[2,31,7,31],[2,32,7,32],[2,33,7,33],[2,34,7,34],[2,35,7,35]]}
[]
[null,{"$f":"CONCATENATE(\"Du \",Q11,\"/\",R11,\"/\",S11,\" au \",Q12,\"/\",R12,\"/\",S12)","v":"Du 16/9/2019 au 22/9/2019"},null,null,null,null,null,null,null,"Semaine :",37,{"$f":"Planning_général!C2","v":2019},null,null,null,null,null,null,null,null,null,null,1]
[null,"Équipes",null,null,"Horaires",null,"Pause",null,"NOM et Prénom",null,null,"Matricul",null,null,null,null,null,null,null,null,null,null,{"$f":"Planning_général!$E55","v":"Resp Equipe 4"},{"$f":"Planning_général!$E56","v":"Equipe 4_Tech 1"},{"$f":"Planning_général!$E57","v":"Equipe 4_Tech 2"},{"$f":"Planning_général!$E58","v":"Equipe 4_Tech 3"},{"$f":"Planning_général!$E59","v":"Equipe 4_Tech 4"},{"$f":"Planning_général!$E60","v":0},{"$f":"Planning_général!$E61","v":0},{"$f":"Planning_général!$E62","v":" "}]
[]
[null,"Matin",null,"M1","7 h 00 - 11 h 30 sauf mercredi et de 07 h00 à 11h 00 le vendredi",null,"-",null,{"$f":"IF(R31=\"\",\"\",R31)","v":""},null,null,{"$f":"IF(I5=\"\",\"\",VLOOKUP(I5,Planning_général!$E$55:$F$62,2,0))","v":""},null,null,null,"Initial",{"$f":"DATE(L2,1,1)","v":"2019-01-01"},{"$f":"Q5","v":43466}]
[null,null,null,null,null,null,null,null,{"$f":"IF(R32=\"\",\"\",R32)","v":""},null,null,{"$f":"IF(I6=\"\",\"\",VLOOKUP(I6,Planning_général!$E$55:$F$62,2,0))","v":""},null,null,null,"Du",{"$f":"(R5)+($K$2)*7-WEEKDAY(Q5,2)+1","v":"2019-09-16"},null,null,null,null,null,null,null,null,null,null,null,null,null,null,null,null,null,null,null,null,null,null,null,null,null,null,null,null,null,null,null,null,null,null,null,null,null,null,"Semaines"]
[null,null,null,"M2","7 h 00 - 14 h 10 ",null,"12 h 40 - 13 h 00",null,{"$f":"IF(R35=\"\",\"\",R35)","v":""},null,null,{"$f":"IF(I7=\"\",\"\",VLOOKUP(I7,Planning_général!$E$55:$F$62,2,0))","v":""},null,null,null,"Au",{"$f":"Q6+6","v":"2019-09-22"},null,null,null,null,null,null,null,null,null,null,null,null,null,null,null,null,null,null,null,null,null,null,null,null,null,null,null,null,null,null,null,null,null,null,null,null,null,null,1]
[null,null,null,null,null,null,null,null,{"$f":"IF(R36=\"\",\"\",R36)","v":""},null,null,{"$f":"IF(I8=\"\",\"\",VLOOKUP(I8,Planning_général!$E$55:$F$62,2,0))","v":""},null,null,null,null,null,null,null,null,null,null,null,null,null,null,null,null,null,null,null,null,null,null,null,null,null,null,null,null,null,null,null,null,null,null,null,null,null,null,null,null,null,null,null,2]
[null,"Journée",null,"J1","09 h 00 - 16 h 10 ",null,"12 h 20 - 12 h 40",null,{"$f":"IF(R40=\"\",\"\",R40)","v":""},null,null,{"$f":"IF(I9=\"\",\"\",VLOOKUP(I9,Planning_général!$E$55:$F$62,2,0))","v":""},null,null,null,null,null,null,null,null,null,"Code",{"$f":"IF(VLOOKUP(W3,Planning_général!$E$17:$F$62,2,0)=0,\"Cde abs\",VLOOKUP(W3,Planning_général!$E$17:$F$62,2,0))","v":5234},{"$f":"IF(VLOOKUP(X3,Planning_général!$E$17:$F$62,2,0)=0,\"Cde abs\",VLOOKUP(X3,Planning_général!$E$17:$F$62,2,0))","v":8638},{"$f":"IF(VLOOKUP(Y3,Planning_général!$E$17:$F$62,2,0)=0,\"Cde abs\",VLOOKUP(Y3,Planning_général!$E$17:$F$62,2,0))","v":3575},{"$f":"IF(VLOOKUP(Z3,Planning_général!$E$17:$F$62,2,0)=0,\"Cde abs\",VLOOKUP(Z3,Planning_général!$E$17:$F$62,2,0))","v":6793},{"$f":"IF(VLOOKUP(AA3,Planning_général!$E$17:$F$62,2,0)=0,\"Cde abs\",VLOOKUP(AA3,Planning_général!$E$17:$F$62,2,0))","v":6647},{"$f":"IF(VLOOKUP(AB3,Planning_général!$E$17:$F$62,2,0)=0,\"Cde abs\",VLOOKUP(AB3,Planning_général!$E$17:$F$62,2,0))","v":{"$error":"#N/A"}},{"$f":"IF(VLOOKUP(AC3,Planning_général!$E$17:$F$62,2,0)=0,\"Cde abs\",VLOOKUP(AC3,Planning_général!$E$17:$F$62,2,0))","v":{"$error":"#N/A"}},{"$f":"IF(VLOOKUP(AD3,Planning_général!$E$17:$F$62,2,0)=0,\"Cde abs\",VLOOKUP(AD3,Planning_général!$E$17:$F$62,2,0))","v":"Cde abs"},{"$f":"IF(VLOOKUP(AE3,Planning_général!$E$17:$F$62,2,0)=0,\"Cde abs\",VLOOKUP(AE3,Planning_général!$E$17:$F$62,2,0))","v":{"$error":"#N/A"}},{"$f":"IF(VLOOKUP(AF3,Planning_général!$E$17:$F$62,2,0)=0,\"Cde abs\",VLOOKUP(AF3,Planning_général!$E$17:$F$62,2,0))","v":{"$error":"#N/A"}},{"$f":"IF(VLOOKUP(AG3,Planning_général!$E$17:$F$62,2,0)=0,\"Cde abs\",VLOOKUP(AG3,Planning_général!$E$17:$F$62,2,0))","v":{"$error":"#N/A"}},{"$f":"IF(VLOOKUP(AH3,Planning_général!$E$17:$F$62,2,0)=0,\"Cde abs\",VLOOKUP(AH3,Planning_général!$E$17:$F$62,2,0))","v":{"$error":"#N/A"}},{"$f":"IF(VLOOKUP(AI3,Planning_général!$E$17:$F$62,2,0)=0,\"Cde abs\",VLOOKUP(AI3,Planning_général!$E$17:$F$62,2,0))","v":{"$error":"#N/A"}},{"$f":"IF(VLOOKUP(AJ3,Planning_général!$E$17:$F$62,2,0)=0,\"Cde abs\",VLOOKUP(AJ3,Planning_général!$E$17:$F$62,2,0))","v":{"$error":"#N/A"}},{"$f":"IF(AK3=0,\"\",IF(VLOOKUP(AK3,Planning_général!$E$17:$F$62,2,0)=0,\"Cde abs\",VLOOKUP(AK3,Planning_général!$E$17:$F$62,2,0)))","v":""},null,null,null,"Code","Descriptif","Horaires","Pause",null,null,null,null,null,null,null,null,null,null,null,3]
[null,null,null,null,null,null,null,null,{"$f":"IF(R41=\"\",\"\",R41)","v":""},null,null,{"$f":"IF(I10=\"\",\"\",VLOOKUP(I10,Planning_général!$E$55:$F$62,2,0))","v":""},null,null,null,null,null,null,null,null,{"$f":"Planning_général!G10","v":"M"},{"$f":"VLOOKUP(U10,Planning_général!$NV$20:$NW$26,2,0)","v":"Mardi"},{"$f":"VLOOKUP(W3,Planning_général!$E$55:$NM$55,((($K$2*7)+2)-6),0)","v":0},{"$f":"IF(ISNA(VLOOKUP(X3,Planning_général!$E$56:$NM$56,((($K$2*7)+2)-6),0)),0,VLOOKUP(X3,Planning_général!$E$56:$NM$56,((($K$2*7)+2)-6),0))","v":0},{"$f":"VLOOKUP(Y3,Planning_général!$E$57:$NM$57,((($K$2*7)+2)-6),0)","v":0},{"$f":"VLOOKUP(Z3,Planning_général!$E$58:$NM$58,((($K$2*7)+2)-6),0)","v":0},{"$f":"VLOOKUP(AA3,Planning_général!$E$59:$NM$59,((($K$2*7)+2)-6),0)","v":0},{"$f":"VLOOKUP(AB3,Planning_général!$E$60:$NM$60,((($K$2*7)+2)-6),0)","v":{"$error":"#N/A"}},{"$f":"VLOOKUP($AC$3,Planning_général!$E$61:$NM$61,((($K$2*7)+2)-6),0)","v":{"$error":"#N/A"}},{"$f":"VLOOKUP($AD$3,Planning_général!$E$62:$NM$62,((($K$2*7)+2)-6),0)","v":0},{"$f":"VLOOKUP($AE$3,Planning_général!$E$25:$NM$25,((($K$2*7)+2)-6),0)","v":{"$error":"#N/A"}},{"$f":"VLOOKUP($AF$3,Planning_général!$E$26:$NM$26,((($K$2*7)+2)-6),0)","v":{"$error":"#N/A"}},{"$f":"VLOOKUP($AG$3,Planning_général!$E$27:$NM$27,((($K$2*7)+2)-6),0)","v":{"$error":"#N/A"}},{"$f":"VLOOKUP($AH$3,Planning_général!$E$28:$NM$28,((($K$2*7)+2)-6),0)","v":{"$error":"#N/A"}},{"$f":"VLOOKUP($AI$3,Planning_général!$E$29:$NM$29,((($K$2*7)+2)-6),0)","v":{"$error":"#N/A"}},{"$f":"VLOOKUP($AJ$3,Planning_général!$E$30:$NM$30,((($K$2*7)+2)-6),0)","v":{"$error":"#N/A"}},{"$f":"IF(ISNA(VLOOKUP($AK$3,Planning_général!$E$31:$NM$31,((($K$2*7)+2)-6),0)),0,VLOOKUP($AK$3,Planning_général!$E$31:$NM$31,((($K$2*7)+2)-6),0))","v":0},null,null,null,"M1","Matin","7 h 00 - 11 h 30 sauf mercredi","-",null,null,null,null,null,null,null,null,null,null,null,4]
[null,null,null,"J2","9 h 00 - 13 h 00 / 14 h 00 - 17 h 00 ",null,"10 h 00 -10 h 10 /                 15 h 00 -15 h 10",null,{"$f":"IF(R45=\"\",\"\",R45)","v":""},null,null,{"$f":"IF(I11=\"\",\"\",VLOOKUP(I11,Planning_général!$E$55:$F$62,2,0))","v":""},null,null,null,{"$f":"Q6","v":"2019-09-16"},{"$f":"DAY(P11)","v":16},{"$f":"MONTH(P11)","v":9},{"$f":"YEAR(P11)","v":2019},null,{"$f":"Planning_général!H10","v":"Me"},{"$f":"VLOOKUP(U11,Planning_général!$NV$20:$NW$26,2,0)","v":"Mercredi"},{"$f":"VLOOKUP($W$3,Planning_général!$E$55:$NM$55,((($K$2*7)+2)-5),0)","v":0},{"$f":"VLOOKUP($X$3,Planning_général!$E$56:$NM$56,((($K$2*7)+2)-5),0)","v":0},{"$f":"VLOOKUP($Y$3,Planning_général!$E$57:$NM$57,((($K$2*7)+2)-5),0)","v":0},{"$f":"VLOOKUP($Z$3,Planning_général!$E$58:$NM$58,((($K$2*7)+2)-5),0)","v":0},{"$f":"VLOOKUP($AA$3,Planning_général!$E$59:$NM$59,((($K$2*7)+2)-5),0)","v":0},{"$f":"VLOOKUP($AB$3,Planning_général!$E$60:$NM$60,((($K$2*7)+2)-5),0)","v":{"$error":"#N/A"}},{"$f":"VLOOKUP($AC$3,Planning_général!$E$61:$NM$61,((($K$2*7)+2)-5),0)","v":{"$error":"#N/A"}},{"$f":"VLOOKUP($AD$3,Planning_général!$E$62:$NM$62,((($K$2*7)+2)-5),0)","v":0},{"$f":"VLOOKUP($AE$3,Planning_général!$E$25:$NM$25,((($K$2*7)+2)-5),0)","v":{"$error":"#N/A"}},{"$f":"VLOOKUP($AF$3,Planning_général!$E$26:$NM$26,((($K$2*7)+2)-5),0)","v":{"$error":"#N/A"}},{"$f":"VLOOKUP($AG$3,Planning_général!$E$27:$NM$27,((($K$2*7)+2)-5),0)","v":{"$error":"#N/A"}},{"$f":"VLOOKUP($AH$3,Planning_général!$E$28:$NM$28,((($K$2*7)+2)-5),0)","v":{"$error":"#N/A"}},{"$f":"VLOOKUP($AI$3,Planning_général!$E$29:$NM$29,((($K$2*7)+2)-5),0)","v":{"$error":"#N/A"}},{"$f":"VLOOKUP($AJ$3,Planning_général!$E$30:$NM$30,((($K$2*7)+2)-5),0)","v":{"$error":"#N/A"}},{"$f":"IF(ISNA(VLOOKUP($AK$3,Planning_général!$E$31:$NM$31,((($K$2*7)+2)-5),0)),0,VLOOKUP($AK$3,Planning_général!$E$31:$NM$31,((($K$2*7)+2)-5),0))","v":0},null,null,null,"M2","Matin","7 h 00 - 14 h 10 ","12 h 40 - 13 h 00",null,null,null,null,null,null,null,null,null,null,null,5]
[null,null,null,null,null,null,null,null,{"$f":"IF(R46=\"\",\"\",R46)","v":""},null,null,{"$f":"IF(I12=\"\",\"\",VLOOKUP(I12,Planning_général!$E$55:$F$62,2,0))","v":""},null,null,null,{"$f":"Q7","v":"2019-09-22"},{"$f":"DAY(P12)","v":22},{"$f":"MONTH(P12)","v":9},{"$f":"YEAR(P12)","v":2019},null,{"$f":"Planning_général!I10","v":"J"},{"$f":"VLOOKUP(U12,Planning_général!$NV$20:$NW$26,2,0)","v":"Jeudi"},{"$f":"VLOOKUP($W$3,Planning_général!$E$55:$NM$55,((($K$2*7)+2)-4),0)","v":0},{"$f":"VLOOKUP($X$3,Planning_général!$E$56:$NM$56,((($K$2*7)+2)-4),0)","v":0},{"$f":"VLOOKUP($Y$3,Planning_général!$E$57:$NM$57,((($K$2*7)+2)-4),0)","v":0},{"$f":"VLOOKUP($Z$3,Planning_général!$E$58:$NM$58,((($K$2*7)+2)-4),0)","v":0},{"$f":"VLOOKUP($AA$3,Planning_général!$E$59:$NM$59,((($K$2*7)+2)-4),0)","v":0},{"$f":"VLOOKUP($AB$3,Planning_général!$E$60:$NM$60,((($K$2*7)+2)-4),0)","v":{"$error":"#N/A"}},{"$f":"VLOOKUP($AC$3,Planning_général!$E$61:$NM$61,((($K$2*7)+2)-4),0)","v":{"$error":"#N/A"}},{"$f":"VLOOKUP($AD$3,Planning_général!$E$62:$NM$62,((($K$2*7)+2)-4),0)","v":0},{"$f":"VLOOKUP($AE$3,Planning_général!$E$25:$NM$25,((($K$2*7)+2)-4),0)","v":{"$error":"#N/A"}},{"$f":"VLOOKUP($AF$3,Planning_général!$E$26:$NM$26,((($K$2*7)+2)-4),0)","v":{"$error":"#N/A"}},{"$f":"VLOOKUP($AG$3,Planning_général!$E$27:$NM$27,((($K$2*7)+2)-4),0)","v":{"$error":"#N/A"}},{"$f":"VLOOKUP($AH$3,Planning_général!$E$28:$NM$28,((($K$2*7)+2)-4),0)","v":{"$error":"#N/A"}},{"$f":"VLOOKUP($AI$3,Planning_général!$E$29:$NM$29,((($K$2*7)+2)-4),0)","v":{"$error":"#N/A"}},{"$f":"VLOOKUP($AJ$3,Planning_général!$E$30:$NM$30,((($K$2*7)+2)-4),0)","v":{"$error":"#N/A"}},{"$f":"IF(ISNA(VLOOKUP($AK$3,Planning_général!$E$31:$NM$31,((($K$2*7)+2)-4),0)),0,VLOOKUP($AK$3,Planning_général!$E$31:$NM$31,((($K$2*7)+2)-4),0))","v":0},null,null,null,"J4","Journée 4","09 h 30 - 16 h 40 ","12 h 20 - 12 h 40",null,null,null,null,null,null,null,null,null,null,null,6]
[null,null,null,"J3","8 h 00 - 12 h 00 / 13 h 30 - 17 h 30 ",null,"10 h 00 -10 h 10 /                 15 h 00 -15 h 10",null,{"$f":"IF(R50=\"\",\"\",R50)","v":""},null,null,{"$f":"IF(I13=\"\",\"\",VLOOKUP(I13,Planning_général!$E$55:$F$62,2,0))","v":""},null,null,null,null,null,null,null,null,{"$f":"Planning_général!J10","v":"V"},{"$f":"VLOOKUP(U13,Planning_général!$NV$20:$NW$26,2,0)","v":"Vendredi"},{"$f":"VLOOKUP($W$3,Planning_général!$E$55:$NM$55,((($K$2*7)+2)-3),0)","v":0},{"$f":"VLOOKUP($X$3,Planning_général!$E$56:$NM$56,((($K$2*7)+2)-3),0)","v":0},{"$f":"VLOOKUP($Y$3,Planning_général!$E$57:$NM$57,((($K$2*7)+2)-3),0)","v":0},{"$f":"VLOOKUP($Z$3,Planning_général!$E$58:$NM$58,((($K$2*7)+2)-3),0)","v":0},{"$f":"VLOOKUP($AA$3,Planning_général!$E$59:$NM$59,((($K$2*7)+2)-3),0)","v":0},{"$f":"VLOOKUP($AB$3,Planning_général!$E$60:$NM$60,((($K$2*7)+2)-3),0)","v":{"$error":"#N/A"}},{"$f":"VLOOKUP($AC$3,Planning_général!$E$61:$NM$61,((($K$2*7)+2)-3),0)","v":{"$error":"#N/A"}},{"$f":"VLOOKUP($AD$3,Planning_général!$E$62:$NM$62,((($K$2*7)+2)-3),0)","v":0},{"$f":"VLOOKUP($AE$3,Planning_général!$E$25:$NM$25,((($K$2*7)+2)-3),0)","v":{"$error":"#N/A"}},{"$f":"VLOOKUP($AF$3,Planning_général!$E$26:$NM$26,((($K$2*7)+2)-3),0)","v":{"$error":"#N/A"}},{"$f":"VLOOKUP($AG$3,Planning_général!$E$27:$NM$27,((($K$2*7)+2)-3),0)","v":{"$error":"#N/A"}},{"$f":"VLOOKUP($AH$3,Planning_général!$E$28:$NM$28,((($K$2*7)+2)-3),0)","v":{"$error":"#N/A"}},{"$f":"VLOOKUP($AI$3,Planning_général!$E$29:$NM$29,((($K$2*7)+2)-3),0)","v":{"$error":"#N/A"}},{"$f":"VLOOKUP($AJ$3,Planning_général!$E$30:$NM$30,((($K$2*7)+2)-3),0)","v":{"$error":"#N/A"}},{"$f":"IF(ISNA(VLOOKUP($AK$3,Planning_général!$E$31:$NM$31,((($K$2*7)+2)-3),0)),0,VLOOKUP($AK$3,Planning_général!$E$31:$NM$31,((($K$2*7)+2)-3),0))","v":0},null,null,null,"J1","Journée 1","09 h 00 - 16 h 10 ","12 h 20 - 12 h 40",null,null,null,null,null,null,null,null,null,null,null,7]
[null,null,null,null,null,null,null,null,{"$f":"IF(R51=\"\",\"\",R51)","v":""},null,null,{"$f":"IF(I14=\"\",\"\",VLOOKUP(I14,Planning_général!$E$55:$F$62,2,0))","v":""},null,null,null,null,null,null,null,null,{"$f":"Planning_général!K10","v":"S"},{"$f":"VLOOKUP(U14,Planning_général!$NV$20:$NW$26,2,0)","v":"Samedi"},{"$f":"VLOOKUP($W$3,Planning_général!$E$55:$NM$55,((($K$2*7)+2)-2),0)","v":0},{"$f":"VLOOKUP($X$3,Planning_général!$E$56:$NM$56,((($K$2*7)+2)-2),0)","v":0},{"$f":"VLOOKUP($Y$3,Planning_général!$E$57:$NM$57,((($K$2*7)+2)-2),0)","v":0},{"$f":"VLOOKUP($Z$3,Planning_général!$E$58:$NM58,((($K$2*7)+2)-2),0)","v":0},{"$f":"VLOOKUP($AA$3,Planning_général!$E$59:$NM$59,((($K$2*7)+2)-2),0)","v":0},{"$f":"VLOOKUP($AB$3,Planning_général!$E$60:$NM$60,((($K$2*7)+2)-2),0)","v":{"$error":"#N/A"}},{"$f":"VLOOKUP($AC$3,Planning_général!$E$61:$NM$61,((($K$2*7)+2)-2),0)","v":{"$error":"#N/A"}},{"$f":"VLOOKUP($AD$3,Planning_général!$E$62:$NM$62,((($K$2*7)+2)-2),0)","v":0},{"$f":"VLOOKUP($AE$3,Planning_général!$E$25:$NM$25,((($K$2*7)+2)-2),0)","v":{"$error":"#N/A"}},{"$f":"VLOOKUP($AF$3,Planning_général!$E$26:$NM$26,((($K$2*7)+2)-2),0)","v":{"$error":"#N/A"}},{"$f":"VLOOKUP($AG$3,Planning_général!$E$27:$NM$27,((($K$2*7)+2)-2),0)","v":{"$error":"#N/A"}},{"$f":"VLOOKUP($AH$3,Planning_général!$E$28:$NM$28,((($K$2*7)+2)-2),0)","v":{"$error":"#N/A"}},{"$f":"VLOOKUP($AI$3,Planning_général!$E$29:$NM$29,((($K$2*7)+2)-2),0)","v":{"$error":"#N/A"}},{"$f":"VLOOKUP($AJ$3,Planning_général!$E$30:$NM$30,((($K$2*7)+2)-2),0)","v":{"$error":"#N/A"}},{"$f":"IF(ISNA(VLOOKUP($AK$3,Planning_général!$E$31:$NM$31,((($K$2*7)+2)-2),0)),0,VLOOKUP($AK$3,Planning_général!$E$31:$NM$31,((($K$2*7)+2)-2),0))","v":0},null,null,null,"J2","Journée 2","9 h 00 - 13 h 00 / 14 h 00 - 17 h 00 ","11 h 00 - 11 h 10",null,null,null,null,null,null,null,null,null,null,null,8]
[null,null,null,"J4","09 h 30 - 16 h 40 ",null,"12 h 20 - 12 h 40",null,{"$f":"IF(R55=\"\",\"\",R55)","v":""},null,null,{"$f":"IF(I15=\"\",\"\",VLOOKUP(I15,Planning_général!$E$55:$F$62,2,0))","v":""},null,null,null,null,null,null,null,null,{"$f":"Planning_général!L10","v":"D"},{"$f":"VLOOKUP(U15,Planning_général!$NV$20:$NW$26,2,0)","v":"Dimanche"},{"$f":"VLOOKUP($W$3,Planning_général!$E$55:$NM$55,((($K$2*7)+2)-1),0)","v":0},{"$f":"VLOOKUP($X$3,Planning_général!$E$56:$NM$56,((($K$2*7)+2)-1),0)","v":0},{"$f":"VLOOKUP($Y$3,Planning_général!$E$57:$NM$57,((($K$2*7)+2)-1),0)","v":0},{"$f":"VLOOKUP($Z$3,Planning_général!$E$58:$NM$58,((($K$2*7)+2)-1),0)","v":0},{"$f":"VLOOKUP($AA$3,Planning_général!$E$59:$NM$59,((($K$2*7)+2)-1),0)","v":0},{"$f":"VLOOKUP($AB$3,Planning_général!$E$60:$NM60,((($K$2*7)+2)-1),0)","v":{"$error":"#N/A"}},{"$f":"VLOOKUP($AC$3,Planning_général!$E$61:$NM$61,((($K$2*7)+2)-1),0)","v":{"$error":"#N/A"}},{"$f":"VLOOKUP($AD$3,Planning_général!$E$62:$NM$62,((($K$2*7)+2)-1),0)","v":0},{"$f":"VLOOKUP($AE$3,Planning_général!$E$25:$NM$25,((($K$2*7)+2)-1),0)","v":{"$error":"#N/A"}},{"$f":"VLOOKUP($AF$3,Planning_général!$E$26:$NM$26,((($K$2*7)+2)-1),0)","v":{"$error":"#N/A"}},{"$f":"VLOOKUP($AG$3,Planning_général!$E$27:$NM$27,((($K$2*7)+2)-1),0)","v":{"$error":"#N/A"}},{"$f":"VLOOKUP($AH$3,Planning_général!$E$28:$NM$28,((($K$2*7)+2)-1),0)","v":{"$error":"#N/A"}},{"$f":"VLOOKUP($AI$3,Planning_général!$E$29:$NM$29,((($K$2*7)+2)-1),0)","v":{"$error":"#N/A"}},{"$f":"VLOOKUP($AJ$3,Planning_général!$E$30:$NM$30,((($K$2*7)+2)-1),0)","v":{"$error":"#N/A"}},{"$f":"IF(ISNA(VLOOKUP($AK$3,Planning_général!$E$31:$NM$31,((($K$2*7)+2)-1),0)),0,VLOOKUP($AK$3,Planning_général!$E$31:$NM$31,((($K$2*7)+2)-1),0))","v":0},null,null,null,"J3","Journée 3","8 h 00 - 12 h 00 / 13 h 30 - 17 h 30 ","10 h 00 -10 h 10 / 15 h 00 -15 h 10",null,null,null,null,null,null,null,null,null,null,null,9]
[null,null,null,null,null,null,null,null,{"$f":"IF(R56=\"\",\"\",R56)","v":""},null,null,{"$f":"IF(I16=\"\",\"\",VLOOKUP(I16,Planning_général!$E$55:$F$62,2,0))","v":""},null,null,null,null,null,null,null,null,{"$f":"Planning_général!M10","v":"L"},{"$f":"VLOOKUP(U16,Planning_général!$NV$20:$NW$26,2,0)","v":"Lundi"},{"$f":"VLOOKUP($W$3,Planning_général!$E$55:$NM$55,((($K$2*7)+2)-0),0)","v":0},{"$f":"VLOOKUP($X$3,Planning_général!$E$56:$NM$56,((($K$2*7)+2)-0),0)","v":0},{"$f":"VLOOKUP($Y$3,Planning_général!$E$57:$NM$57,((($K$2*7)+2)-0),0)","v":0},{"$f":"VLOOKUP($Z$3,Planning_général!$E$58:$NM$58,((($K$2*7)+2)-0),0)","v":0},{"$f":"VLOOKUP($AA$3,Planning_général!$E$59:$NM$59,((($K$2*7)+2)-0),0)","v":0},{"$f":"VLOOKUP($AB$3,Planning_général!$E$60:$NM$60,((($K$2*7)+2)-0),0)","v":{"$error":"#N/A"}},{"$f":"VLOOKUP($AC$3,Planning_général!$E$61:$NM$61,((($K$2*7)+2)-0),0)","v":{"$error":"#N/A"}},{"$f":"VLOOKUP($AD$3,Planning_général!$E$62:$NM$62,((($K$2*7)+2)-0),0)","v":0},{"$f":"VLOOKUP($AE$3,Planning_général!$E$25:$NM$25,((($K$2*7)+2)-0),0)","v":{"$error":"#N/A"}},{"$f":"VLOOKUP($AF$3,Planning_général!$E$26:$NM$26,((($K$2*7)+2)-0),0)","v":{"$error":"#N/A"}},{"$f":"VLOOKUP($AG$3,Planning_général!$E$27:$NM$27,((($K$2*7)+2)-0),0)","v":{"$error":"#N/A"}},{"$f":"VLOOKUP($AH$3,Planning_général!$E$28:$NM$28,((($K$2*7)+2)-0),0)","v":{"$error":"#N/A"}},{"$f":"VLOOKUP($AI$3,Planning_général!$E$29:$NM$29,((($K$2*7)+2)-0),0)","v":{"$error":"#N/A"}},{"$f":"VLOOKUP($AJ$3,Planning_général!$E$30:$NM$30,((($K$2*7)+2)-0),0)","v":{"$error":"#N/A"}},{"$f":"IF(ISNA(VLOOKUP($AK$3,Planning_général!$E$31:$NM$31,((($K$2*7)+2)-0),0)),0,VLOOKUP($AK$3,Planning_général!$E$31:$NM$31,((($K$2*7)+2)-0),0))","v":0},null,null,null,null,null,null,null,null,null,null,null,null,null,null,null,null,null,null,10]
[null,null,null,null,null,null,null,null,null,null,null,null,null,null,null,null,null,null,null,null,null,null,null,null,null,null,null,null,null,null,null,null,null,null,null,null,null,null,null,null,null,null,null,null,null,null,null,null,null,null,null,null,null,null,null,12]
[null,"Absences (CP/ Modul/      Repos       /Formation)",null,null,"Lundi",{"$f":"VLOOKUP(E18,$O$71:$S$77,3,0)","v":""},null,null,null,null,null,null,null,null,null,null,null,null,null,null,null,null,null,null,null,null,null,null,null,null,null,null,null,null,null,null,null,null,null,null,null,null,null,null,null,null,null,null,null,null,null,null,null,null,null,13]
[null,null,null,null,"Mardi",{"$f":"VLOOKUP(E19,$O$71:$S$77,3,0)","v":""},null,null,null,null,null,null,null,null,null,null,null,null,null,null,null,{"$f":"AO10","v":"M1"},{"$f":"IF(COUNTIF($W$10:$W$16,V19)=0,\"\",COUNTIF($W$10:$W$16,V19))","v":""},{"$f":"IF(COUNTIF($X$10:$X$16,V19)=0,\"\",COUNTIF($X$10:$X$16,V19))","v":""},{"$f":"IF(COUNTIF($Y$10:$Y$16,V19)=0,\"\",COUNTIF($Y$10:$Y$16,V19))","v":""},{"$f":"IF(COUNTIF($Z$10:$Z$16,V19)=0,\"\",COUNTIF($Z$10:$Z$16,V19))","v":""},{"$f":"IF(COUNTIF($AA$10:$AA$16,V19)=0,\"\",COUNTIF($AA$10:$AA$16,V19))","v":""},{"$f":"IF(COUNTIF($AB$10:$AB$16,V19)=0,\"\",COUNTIF($AB$10:$AB$16,V19))","v":""},{"$f":"IF(COUNTIF($AC$10:$AC$16,V19)=0,\"\",COUNTIF($AC$10:$AC$16,V19))","v":""},{"$f":"IF(COUNTIF($AD$10:$AD$16,$V$19)=0,\"\",COUNTIF($AD$10:$AD$16,$V$19))","v":""},{"$f":"IF(COUNTIF($AE$10:$AE$16,$V$19)=0,\"\",COUNTIF($AE$10:$AE$16,$V$19))","v":""},{"$f":"IF(COUNTIF($AF$10:$AF$16,$V$19)=0,\"\",COUNTIF($AF$10:$AF$16,$V$19))","v":""},{"$f":"IF(COUNTIF($AG$10:$AG$16,$V$19)=0,\"\",COUNTIF($AG$10:$AG$16,$V$19))","v":""},{"$f":"IF(COUNTIF($AH$10:$AH$16,$V$19)=0,\"\",COUNTIF($AH$10:$AH$16,$V$19))","v":""},{"$f":"IF(COUNTIF($AI$10:$AI$16,$V$19)=0,\"\",COUNTIF($AI$10:$AI$16,$V$19))","v":""},{"$f":"IF(COUNTIF($AJ$10:$AJ$16,$V$19)=0,\"\",COUNTIF($AJ$10:$AJ$16,$V$19))","v":""},{"$f":"IF(COUNTIF($AK$10:$AK$16,$V$19)=0,\"\",COUNTIF($AK$10:$AK$16,$V$19))","v":""},null,null,null,"Code",null,null,null,null,null,null,null,null,null,null,null,null,null,null,16]
[null,null,null,null,"Mercredi","",null,null,null,null,null,null,null,null,null,null,null,null,null,null,null,{"$f":"AO11","v":"M2"},"","","","","","",{"$f":"IF(COUNTIF($AC$10:$AC$16,V20)=0,\"\",COUNTIF($AC$10:$AC$16,V20))","v":""},{"$f":"IF(COUNTIF($AD$10:$AD$16,$V$20)=0,\"\",COUNTIF($AD$10:$AD$16,$V$20))","v":""},{"$f":"IF(COUNTIF($AE$10:$AE$16,$V$20)=0,\"\",COUNTIF($AE$10:$AE$16,$V$20))","v":""},{"$f":"IF(COUNTIF($AF$10:$AF$16,$V$20)=0,\"\",COUNTIF($AF$10:$AF$16,$V$20))","v":""},{"$f":"IF(COUNTIF($AG$10:$AG$16,$V$20)=0,\"\",COUNTIF($AG$10:$AG$16,$V$20))","v":""},{"$f":"IF(COUNTIF($AH$10:$AH$16,$V$20)=0,\"\",COUNTIF($AH$10:$AH$16,$V$20))","v":""},{"$f":"IF(COUNTIF($AI$10:$AI$16,$V$20)=0,\"\",COUNTIF($AI$10:$AI$16,$V$20))","v":""},{"$f":"IF(COUNTIF($AJ$10:$AJ$16,$V$20)=0,\"\",COUNTIF($AJ$10:$AJ$16,$V$20))","v":""},{"$f":"IF(COUNTIF($AK$10:$AK$16,$V$20)=0,\"\",COUNTIF($AK$10:$AK$16,$V$20))","v":""},null,null,null,"CP",null,null,null,null,null,null,null,null,null,null,null,null,null,null,17]
[null,null,null,null,"Jeudi","",null,null,null,null,null,null,null,null,null,null,null,null,null,null,null,{"$f":"AO12","v":"J4"},"","","","","","",{"$f":"IF(COUNTIF($AC$10:$AC$16,V21)=0,\"\",COUNTIF($AC$10:$AC$16,V21))","v":""},{"$f":"IF(COUNTIF($AC$10:$AC$16,V21)=0,\"\",COUNTIF($AC$10:$AC$16,V21))","v":""},{"$f":"IF(COUNTIF($AE$10:$AE$16,$V$21)=0,\"\",COUNTIF($AE$10:$AE$16,$V$21))","v":""},{"$f":"IF(COUNTIF($AF$10:$AF$16,$V$21)=0,\"\",COUNTIF($AF$10:$AF$16,$V$21))","v":""},{"$f":"IF(COUNTIF($AG$10:$AG$16,$V$21)=0,\"\",COUNTIF($AG$10:$AG$16,$V$21))","v":""},{"$f":"IF(COUNTIF($AH$10:$AH$16,$V$21)=0,\"\",COUNTIF($AH$10:$AH$16,$V$21))","v":""},{"$f":"IF(COUNTIF($AI$10:$AI$16,$V$21)=0,\"\",COUNTIF($AI$10:$AI$16,$V$21))","v":""},{"$f":"IF(COUNTIF($AJ$10:$AJ$16,$V$21)=0,\"\",COUNTIF($AJ$10:$AJ$16,$V$21))","v":""},{"$f":"IF(COUNTIF($AK$10:$AK$16,$V$21)=0,\"\",COUNTIF($AK$10:$AK$16,$V$21))","v":""},null,null,null,"Recup",null,null,null,null,null,null,null,null,null,null,null,null,null,null,18]
[null,null,null,null,"Vendredi","",null,null,null,null,null,null,null,null,null,null,null,null,null,null,null,{"$f":"AO13","v":"J1"},"","","","","","",{"$f":"IF(COUNTIF($AC$10:$AC$16,V22)=0,\"\",COUNTIF($AC$10:$AC$16,V22))","v":""},{"$f":"IF(COUNTIF($AD$10:$AD$16,$V$22)=0,\"\",COUNTIF($AD$10:$AD$16,$V$22))","v":""},{"$f":"IF(COUNTIF($AE$10:$AE$16,$V$22)=0,\"\",COUNTIF($AE$10:$AE$16,$V$22))","v":""},{"$f":"IF(COUNTIF($AF$10:$AF$16,$V$22)=0,\"\",COUNTIF($AF$10:$AF$16,$V$22))","v":""},{"$f":"IF(COUNTIF($AG$10:$AG$16,$V$22)=0,\"\",COUNTIF($AG$10:$AG$16,$V$22))","v":""},{"$f":"IF(COUNTIF($AH$10:$AH$16,$V$22)=0,\"\",COUNTIF($AH$10:$AH$16,$V$22))","v":""},{"$f":"IF(COUNTIF($AI$10:$AI$16,$V$22)=0,\"\",COUNTIF($AI$10:$AI$16,$V$22))","v":""},{"$f":"IF(COUNTIF($AJ$10:$AJ$16,$V$22)=0,\"\",COUNTIF($AJ$10:$AJ$16,$V$22))","v":""},{"$f":"IF(COUNTIF($AK$10:$AK$16,$V$22)=0,\"\",COUNTIF($AK$10:$AK$16,$V$22))","v":""},null,null,null,"Form",null,null,null,null,null,null,null,null,null,null,null,null,null,null,19]
[null,null,null,null,"Samedi","",null,null,null,null,null,null,null,null,null,null,null,null,null,null,null,"J2","","","","","","",{"$f":"IF(COUNTIF($AC$10:$AC$16,$V$23)=0,\"\",COUNTIF($AC$10:$AC$16,V23))","v":""},{"$f":"IF(COUNTIF($AD$10:$AD$16,$V$23)=0,\"\",COUNTIF($AD$10:$AD$16,$V$23))","v":""},{"$f":"IF(COUNTIF($AE$10:$AE$16,$V$23)=0,\"\",COUNTIF($AE$10:$AE$16,$V$23))","v":""},{"$f":"IF(COUNTIF($AF$10:$AF$16,$V$23)=0,\"\",COUNTIF($AF$10:$AF$16,$V$23))","v":""},{"$f":"IF(COUNTIF($AG$10:$AG$16,$V$23)=0,\"\",COUNTIF($AG$10:$AG$16,$V$23))","v":""},{"$f":"IF(COUNTIF($AH$10:$AH$16,$V$23)=0,\"\",COUNTIF($AH$10:$AH$16,$V$23))","v":""},{"$f":"IF(COUNTIF($AI$10:$AI$16,$V$23)=0,\"\",COUNTIF($AI$10:$AI$16,$V$23))","v":""},{"$f":"IF(COUNTIF($AJ$10:$AJ$16,$V$23)=0,\"\",COUNTIF($AJ$10:$AJ$16,$V$23))","v":""},{"$f":"IF(COUNTIF($AK$10:$AK$16,$V$23)=0,\"\",COUNTIF($AK$10:$AK$16,$V$23))","v":""},null,null,null,"Modul",null,null,null,null,null,null,null,null,null,null,null,null,null,null,20]
[null,null,null,null,null,null,null,null,null,null,null,null,null,null,null,null,null,null,null,null,null,"J3","","","","","","",{"$f":"IF(COUNTIF($AC$10:$AC$16,$V$24)=0,\"\",COUNTIF($AC$10:$AC$16,V24))","v":""},{"$f":"IF(COUNTIF($AD$10:$AD$16,$V$24)=0,\"\",COUNTIF($AD$10:$AD$16,$V$24))","v":""},{"$f":"IF(COUNTIF($AE$10:$AE$16,$V$24)=0,\"\",COUNTIF($AE$10:$AE$16,$V$24))","v":""},{"$f":"IF(COUNTIF($AF$10:$AF$16,$V$24)=0,\"\",COUNTIF($AF$10:$AF$16,$V$24))","v":""},{"$f":"IF(COUNTIF($AG$10:$AG$16,$V$24)=0,\"\",COUNTIF($AG$10:$AG$16,$V$24))","v":""},{"$f":"IF(COUNTIF($AH$10:$AH$16,$V$24)=0,\"\",COUNTIF($AH$10:$AH$16,$V$24))","v":""},{"$f":"IF(COUNTIF($AI$10:$AI$16,$V$24)=0,\"\",COUNTIF($AI$10:$AI$16,$V$24))","v":""},{"$f":"IF(COUNTIF($AJ$10:$AJ$16,$V$24)=0,\"\",COUNTIF($AJ$10:$AJ$16,$V$24))","v":""},{"$f":"IF(COUNTIF($AK$10:$AK$16,$V$24)=0,\"\",COUNTIF($AK$10:$AK$16,$V$24))","v":""},null,null,null,"H.R",null,null,null,null,null,null,null,null,null,null,null,null,null,null,21]
[null,null,null,null,null,null,null,null,null,null,null,null,null,null,null,null,null,null,null,null,null,"-","","","","","","",{"$f":"IF(COUNTIF($AC$10:$AC$16,$V$25)=0,\"\",COUNTIF($AC$10:$AC$16,V25))","v":""},{"$f":"IF(COUNTIF($AD$10:$AD$16,$V$25)=0,\"\",COUNTIF($AD$10:$AD$16,$V$25))","v":""},{"$f":"IF(COUNTIF($AE$10:$AE$16,$V$25)=0,\"\",COUNTIF($AE$10:$AE$16,$V$25))","v":""},{"$f":"IF(COUNTIF($AF$10:$AF$16,$V$25)=0,\"\",COUNTIF($AF$10:$AF$16,$V$25))","v":""},{"$f":"IF(COUNTIF($AG$10:$AG$16,$V$25)=0,\"\",COUNTIF($AG$10:$AG$16,$V$25))","v":""},{"$f":"IF(COUNTIF($AH$10:$AH$16,$V$25)=0,\"\",COUNTIF($AH$10:$AH$16,$V$25))","v":""},{"$f":"IF(COUNTIF($AI$10:$AI$16,$V$25)=0,\"\",COUNTIF($AI$10:$AI$16,$V$25))","v":""},{"$f":"IF(COUNTIF($AJ$10:$AJ$16,$V$25)=0,\"\",COUNTIF($AJ$10:$AJ$16,$V$25))","v":""},{"$f":"IF(COUNTIF($AK$10:$AK$16,$V$25)=0,\"\",COUNTIF($AK$10:$AK$16,$V$25))","v":""},null,null,null,"HR Nuit",null,null,null,null,null,null,null,null,null,null,null,null,null,null,22]
[null,null,null,null,null,null,null,null,null,null,null,null,null,null,null,null,null,null,null,null,null,"-","","","","","","",{"$f":"IF(COUNTIF($AC$10:$AC$16,V26)=0,\"\",COUNTIF($AC$10:$AC$16,V26))","v":""},{"$f":"IF(COUNTIF($AD$10:$AD$16,$V$26)=0,\"\",COUNTIF($AD$10:$AD$16,$V$26))","v":""},{"$f":"IF(COUNTIF($AE$10:$AE$16,$V$26)=0,\"\",COUNTIF($AE$10:$AE$16,$V$26))","v":""},{"$f":"IF(COUNTIF($AF$10:$AF$16,$V$26)=0,\"\",COUNTIF($AF$10:$AF$16,$V$26))","v":""},{"$f":"IF(COUNTIF($AG$10:$AG$16,$V$26)=0,\"\",COUNTIF($AG$10:$AG$16,$V$26))","v":""},{"$f":"IF(COUNTIF($AH$10:$AH$16,$V$26)=0,\"\",COUNTIF($AH$10:$AH$16,$V$26))","v":""},{"$f":"IF(COUNTIF($AI$10:$AI$16,$V$26)=0,\"\",COUNTIF($AI$10:$AI$16,$V$26))","v":""},{"$f":"IF(COUNTIF($AJ$10:$AJ$16,$V$26)=0,\"\",COUNTIF($AJ$10:$AJ$16,$V$26))","v":""},{"$f":"IF(COUNTIF($AK$10:$AK$16,$V$26)=0,\"\",COUNTIF($AK$10:$AK$16,$V$26))","v":""},null,null,null,"RTT",null,null,null,null,null,null,null,null,null,null,null,null,null,null,23]
[null,null,null,null,null,null,null,null,null,null,null,null,null,null,null,null,null,null,null,null,null,"Max",{"$f":"MAX(W19:W23)","v":0},{"$f":"MAX(X19:X23)","v":0},0,{"$f":"MAX(Z19:Z26)","v":0},0,0,0,0,0,0,0,0,0,0,{"$f":"MAX(AK19:AK23)","v":0},null,null,null,"Mal",null,null,null,null,null,null,null,null,null,null,null,null,null,null,24]
[null,null,null,null,null,null,null,null,null,null,null,null,null,null,null,null,null,null,null,null,null,null,null,null,null,null,null,null,null,null,null,null,null,null,null,null,null,null,null,null,"J.A",null,null,null,null,null,null,null,null,null,null,null,null,null,null,25]
[null,null,null,null,null,null,null,null,null,null,null,null,null,null,null,null,null,"Techniciens",null,null,null,null,null,null,null,null,null,null,null,null,null,null,null,null,null,null,null,null,null,null,"Ecole",null,null,null,null,null,null,null,null,null,null,null,null,null,null,26]
[null,null,null,null,null,null,null,null,null,null,null,null,null,null,null,null,null,null,null,null,null,null,{"$f":"IF(W27=0,\"\",IF(W19=W27,$V$19,IF(W20=W27,$V$20,IF(W21=W27,$V$21,IF(W22=W27,$V$22,IF(W23=W27,$V$23,IF(W24=W27,$V$24,IF(W25=W27,$V$25,IF(W26=W27,$V$26,\"\")))))))))","v":""},"",{"$f":"IF(Y27=0,\"\",IF(Y19=Y27,$V$19,IF(Y20=Y27,$V$20,IF(Y21=Y27,$V$21,IF(Y22=Y27,$V$22,IF(Y23=Y27,$V$23,IF(Y24=Y27,$V$24,IF(Y25=Y27,$V$25,IF(Y26=Y27,$V$26,\"\")))))))))","v":""},{"$f":"IF(Z27=0,\"\",IF(Z19=Z27,$V$19,IF(Z20=Z27,$V$20,IF(Z21=Z27,$V$21,IF(Z22=Z27,$V$22,IF(Z23=Z27,$V$23,IF(Z24=Z27,$V$24,IF(Z25=Z27,$V$25,IF(Z26=Z27,$V$26,\"\")))))))))","v":""},"","","","","","","","","","","",null,null,null,null,null,null,null,null,null,null,null,null,null,null,null,null,null,null,27]
[null,null,null,null,null,null,null,null,null,null,null,null,null,null,null,null,{"$f":"IF(R31=\"\",\"\",VLOOKUP(R31,Planning_général!$E$55:$F$62,2,0))","v":""},{"$f":"IF(W31=1,$W$3,IF(X31=1,$X$3,IF(Y31=1,$Y$3,IF(Z31=1,Z3,IF(AA31=1,$AA$3,IF(AB31=1,$AB$3,IF(AC31=1,$AC$3,IF(AD31=1,$AD$3,IF(AE31=1,$AE$3,IF(AF31=1,$AF$3,IF(AG31=1,$AG$3,IF(AH31=1,AH3,IF(AI31=1,$AI$3,IF(AJ31=1,$AJ$3,IF(AK31=1,$AK$3,\"\")))))))))))))))","v":""},{"$f":"IF(U31=1,U$9,IF(V31=1,V$9,IF(W31=1,W$9,IF(X31=1,X$9,IF(Y31=1,Y$9,IF(Z31=1,Z$9,IF(AA31=1,AA$9,IF(AB31=1,AB$9,IF(AC31=1,AC$9,IF(AD31=1,AD$9,IF(AE31=1,AE$9,\"\")))))))))))","v":""},"Matin 1",null,"M1",{"$f":"IF($V$31=W30,1,\"\")","v":""},{"$f":"IF(AND($V$31=$X$30,W31=\"\"),1,\"\")","v":""},{"$f":"IF(AND($V$31=$Y$30,X31=\"\",W31=\"\"),1,\"\")","v":""},{"$f":"IF(AND($V$31=Z30,W31=\"\",X31=\"\",Y31=\"\"),1,\"\")","v":""},{"$f":"IF(AND($V$31=AA30,X31=\"\",Y31=\"\",Z31=\"\",W31=\"\"),1,\"\")","v":""},{"$f":"IF(AND($V$31=AB30,Y31=\"\",Z31=\"\",AA31=\"\",X31=\"\",W31=\"\"),1,\"\")","v":""},{"$f":"IF(AND($V$31=AC30,Z31=\"\",AA31=\"\",AB31=\"\",Y31=\"\",X31=\"\",W31=\"\"),1,\"\")","v":""},{"$f":"IF(AND($V$31=AD30,AA31=\"\",AB31=\"\",AC31=\"\",Z31=\"\",Y31=\"\",X31=\"\",W31=\"\"),1,\"\")","v":""},{"$f":"IF(AND($V$31=AE30,AB31=\"\",AC31=\"\",AD31=\"\",AA31=\"\",Z31=\"\",Y31=\"\",X31=\"\",W31=\"\"),1,\"\")","v":""},{"$f":"IF(AND($V$31=AF30,AC31=\"\",AD31=\"\",AE31=\"\",AB31=\"\",AA31=\"\",Z31=\"\",Y31=\"\",X31=\"\",W31=\"\"),1,\"\")","v":""},{"$f":"IF(AND($V$31=AG30,AD31=\"\",AE31=\"\",AF31=\"\",AC31=\"\",AB31=\"\",AA31=\"\",Z31=\"\",Y31=\"\",X31=\"\",W31=\"\"),1,\"\")","v":""},{"$f":"IF(AND($V$31=AH30,AE31=\"\",AF31=\"\",AG31=\"\",AD31=\"\",AC31=\"\",AB31=\"\",AA31=\"\",Z31=\"\",Y31=\"\",X31=\"\",W31=\"\"),1,\"\")","v":""},{"$f":"IF(AND($V$31=AI30,AF31=\"\",AG31=\"\",AH31=\"\",AE31=\"\",AD31=\"\",AC31=\"\",AB31=\"\",AA31=\"\",Z31=\"\",Y31=\"\",X31=\"\",W31=\"\"),1,\"\")","v":""},{"$f":"IF(AND($V$31=AJ30,AG31=\"\",AH31=\"\",AI31=\"\",AF31=\"\",AE31=\"\",AD31=\"\",AC31=\"\",AB31=\"\",AA31=\"\",Z31=\"\",Y31=\"\",X31=\"\",W31=\"\"),1,\"\")","v":""},{"$f":"IF(AND($V$31=AK30,AH31=\"\",AI31=\"\",AJ31=\"\",AG31=\"\",AF31=\"\",AE31=\"\",AD31=\"\",AC31=\"\",AB31=\"\",AA31=\"\",Z31=\"\",Y31=\"\",X31=\"\",W31=\"\"),1,\"\")","v":""},null,null,null,null,null,null,null,null,null,null,null,null,null,null,null,null,null,null,28]
[null,null,null,null,null,null,null,null,null,null,null,null,null,null,null,null,{"$f":"IF(R32=\"\",\"\",VLOOKUP(R32,Planning_général!$E$55:$F$62,2,0))","v":""},{"$f":"IF(W32=1,$W$3,IF(X32=1,$X$3,IF(Y32=1,$Y$3,IF(Z32=1,Z4,IF(AA32=1,$AA$3,IF(AB32=1,$AB$3,IF(AC32=1,$AC$3,IF(AD32=1,$AD$3,IF(AE32=1,$AE$3,IF(AF32=1,$AF$3,IF(AG32=1,$AG$3,IF(AH32=1,AH4,IF(AI32=1,$AI$3,IF(AJ32=1,$AJ$3,IF(AK32=1,$AK$3,\"\")))))))))))))))","v":""},{"$f":"IF(U32=1,U$9,IF(V32=1,V$9,IF(W32=1,W$9,IF(X32=1,X$9,IF(Y32=1,Y$9,IF(Z32=1,Z$9,IF(AA32=1,AA$9,IF(AB32=1,AB$9,IF(AC32=1,AC$9,IF(AD32=1,AD$9,IF(AE32=1,AE$9,\"\")))))))))))","v":""},null,null,"M1",null,{"$f":"IF(AND(X$30=$V$32,W32=\"\",X31=\"\"),1,\"\")","v":""},{"$f":"IF(AND(Y$30=$V$32,X32=\"\",Y31=\"\"),1,\"\")","v":""},"",{"$f":"IF(AND(AA$30=$V$32,AA31=\"\",SUM($X$32:Z32)=0),1,\"\")","v":""},{"$f":"IF(AND(AB$30=$V$32,AB31=\"\",SUM($X$32:AA32)=0),1,\"\")","v":""},{"$f":"IF(AND(AC$30=$V$32,AC31=\"\",SUM($X$32:AB32)=0),1,\"\")","v":""},{"$f":"IF(AND(AD$30=$V$32,AD31=\"\",SUM($X$32:AC32)=0),1,\"\")","v":""},{"$f":"IF(AND(AE$30=$V$32,AE31=\"\",SUM($X$32:AD32)=0),1,\"\")","v":""},{"$f":"IF(AND(AF$30=$V$32,AF31=\"\",SUM($X$32:AE32)=0),1,\"\")","v":""},{"$f":"IF(AND(AG$30=$V$32,AG31=\"\",SUM($X$32:AF32)=0),1,\"\")","v":""},{"$f":"IF(AND(AH$30=$V$32,AH31=\"\",SUM($X$32:AG32)=0),1,\"\")","v":""},{"$f":"IF(AND(AI$30=$V$32,AI31=\"\",SUM($X$32:AH32)=0),1,\"\")","v":""},{"$f":"IF(AND(AJ$30=$V$32,AJ31=\"\",SUM($X$32:AI32)=0),1,\"\")","v":""},{"$f":"IF(AND(AK$30=$V$32,AK31=\"\",SUM($X$32:AJ32)=0),1,\"\")","v":""},null,null,null,null,null,null,null,null,null,null,null,null,null,null,null,null,null,null,29]
[null,null,null,null,null,null,null,null,null,null,null,null,null,null,null,null,{"$f":"IF(R33=\"\",\"\",VLOOKUP(R33,Planning_général!$E$55:$F$62,2,0))","v":""},{"$f":"IF(W33=1,$W$3,IF(X33=1,$X$3,IF(Y33=1,$Y$3,IF(Z33=1,Z3,IF(AA33=1,$AA$3,IF(AB33=1,$AB$3,IF(AC33=1,$AC$3,IF(AD33=1,$AD$3,IF(AE33=1,$AE$3,IF(AF33=1,$AF$3,IF(AG33=1,$AG$3,IF(AH33=1,AH3,IF(AI33=1,$AI$3,IF(AJ33=1,$AJ$3,IF(AK33=1,$AK$3,\"\")))))))))))))))","v":""},{"$f":"IF(U33=1,U$9,IF(V33=1,V$9,IF(W33=1,W$9,IF(X33=1,X$9,IF(Y33=1,Y$9,IF(Z33=1,Z$9,IF(AA33=1,AA$9,IF(AB33=1,AB$9,IF(AC33=1,AC$9,IF(AD33=1,AD$9,IF(AE33=1,AE$9,\"\")))))))))))","v":""},null,null,"-",null,null,{"$f":"IF(AND(Y$30=V33,X33=\"\",Y32=\"\",Y31=\"\"),1,\"\")","v":""},{"$f":"IF(AND(Z$30=V33,Y33=\"\",Z32=\"\",Z31=\"\"),1,\"\")","v":""},{"$f":"IF(AND(AA$30=$V$33,AA31=\"\",AA32=\"\",SUM($Y$33:Z33)=0),1,\"\")","v":""},{"$f":"IF(AND(AB$30=$V$33,AB31=\"\",AB32=\"\",SUM($Y$33:AA33)=0),1,\"\")","v":""},{"$f":"IF(AND(AC$30=$V$33,AC31=\"\",AC32=\"\",SUM($Y$33:AB33)=0),1,\"\")","v":""},{"$f":"IF(AND(AD$30=$V$33,AD31=\"\",AD32=\"\",SUM($Y$33:AC33)=0),1,\"\")","v":""},{"$f":"IF(AND(AE$30=$V$33,AE31=\"\",AE32=\"\",SUM($Y$33:AD33)=0),1,\"\")","v":""},{"$f":"IF(AND(AF$30=$V$33,AF31=\"\",AF32=\"\",SUM($Y$33:AE33)=0),1,\"\")","v":""},{"$f":"IF(AND(AG$30=$V$33,AG31=\"\",AG32=\"\",SUM($Y$33:AF33)=0),1,\"\")","v":""},{"$f":"IF(AND(AH$30=$V$33,AH31=\"\",AH32=\"\",SUM($Y$33:AG33)=0),1,\"\")","v":""},{"$f":"IF(AND(AI$30=$V$33,AI31=\"\",AI32=\"\",SUM($Y$33:AH33)=0),1,\"\")","v":""},{"$f":"IF(AND(AJ$30=$V$33,AJ31=\"\",AJ32=\"\",SUM($Y$33:AI33)=0),1,\"\")","v":""},{"$f":"IF(AND(AK$30=$V$33,AK31=\"\",AK32=\"\",SUM($Y$33:AJ33)=0),1,\"\")","v":""}]
[]
[null,null,null,null,null,null,null,null,null,null,null,null,null,null,null,null,{"$f":"IF(R35=\"\",\"\",VLOOKUP(R35,Planning_général!$E$55:$F$62,2,0))","v":""},{"$f":"IF(W35=1,$W$3,IF(X35=1,$X$3,IF(Y35=1,$Y$3,IF(Z35=1,Z3,IF(AA35=1,$AA$3,IF(AB35=1,$AB$3,IF(AC35=1,$AC$3,IF(AD35=1,$AD$3,IF(AE35=1,$AE$3,IF(AF35=1,$AF$3,IF(AG35=1,$AG$3,IF(AH35=1,AH7,IF(AI35=1,$AI$3,IF(AJ35=1,$AJ$3,IF(AK35=1,$AK$3,\"\")))))))))))))))","v":""},{"$f":"IF(U35=1,U$9,IF(V35=1,V$9,IF(W35=1,W$9,IF(X35=1,X$9,IF(Y35=1,Y$9,IF(Z35=1,Z$9,IF(AA35=1,AA$9,IF(AB35=1,AB$9,IF(AC35=1,AC$9,IF(AD35=1,AD$9,IF(AE35=1,AE$9,\"\")))))))))))","v":""},"Matin 2",null,"M2",{"$f":"IF($V$35=W30,1,\"\")","v":""},{"$f":"IF(AND($V$35=$X$30,W35=\"\"),1,\"\")","v":""},{"$f":"IF(AND($V$35=$Y$30,X35=\"\",W35=\"\"),1,\"\")","v":""},{"$f":"IF(AND($V$35=Z30,W35=\"\",X35=\"\",Y35=\"\"),1,\"\")","v":""},{"$f":"IF(AND($V$35=AA30,X35=\"\",Y35=\"\",Z35=\"\",W35=\"\"),1,\"\")","v":""},{"$f":"IF(AND($V$35=AB30,Y35=\"\",Z35=\"\",AA35=\"\",X35=\"\",W35=\"\"),1,\"\")","v":""},{"$f":"IF(AND($V$35=AC30,Z35=\"\",AA35=\"\",AB35=\"\",Y35=\"\",X35=\"\",W35=\"\"),1,\"\")","v":""},{"$f":"IF(AND($V$35=AD30,AA35=\"\",AB35=\"\",AC35=\"\",Z35=\"\",Y35=\"\",X35=\"\",W35=\"\"),1,\"\")","v":""},{"$f":"IF(AND($V$35=AE30,AB35=\"\",AC35=\"\",AD35=\"\",AA35=\"\",Z35=\"\",Y35=\"\",X35=\"\",W35=\"\"),1,\"\")","v":""},{"$f":"IF(AND($V$35=AF30,AC35=\"\",AD35=\"\",AE35=\"\",AB35=\"\",AA35=\"\",Z35=\"\",Y35=\"\",X35=\"\",W35=\"\"),1,\"\")","v":""},{"$f":"IF(AND($V$35=AG34,AD35=\"\",AE35=\"\",AF35=\"\",AC35=\"\",AB35=\"\",AA35=\"\",Z35=\"\",Y35=\"\",X35=\"\",W35=\"\"),1,\"\")","v":""},{"$f":"IF(AND($V$35=AH34,AE35=\"\",AF35=\"\",AG35=\"\",AD35=\"\",AC35=\"\",AB35=\"\",AA35=\"\",Z35=\"\",Y35=\"\",X35=\"\",W35=\"\"),1,\"\")","v":""},{"$f":"IF(AND($V$35=AI30,AF35=\"\",AG35=\"\",AH35=\"\",AE35=\"\",AD35=\"\",AC35=\"\",AB35=\"\",AA35=\"\",Z35=\"\",Y35=\"\",X35=\"\",W35=\"\"),1,\"\")","v":""},{"$f":"IF(AND($V$35=AJ34,AG35=\"\",AH35=\"\",AI35=\"\",AF35=\"\",AE35=\"\",AD35=\"\",AC35=\"\",AB35=\"\",AA35=\"\",Z35=\"\",Y35=\"\",X35=\"\",W35=\"\"),1,\"\")","v":""},{"$f":"IF(AND($V$35=AK34,AH35=\"\",AI35=\"\",AJ35=\"\",AG35=\"\",AF35=\"\",AE35=\"\",AD35=\"\",AC35=\"\",AB35=\"\",AA35=\"\",Z35=\"\",Y35=\"\",X35=\"\",W35=\"\"),1,\"\")","v":""}]
[null,null,null,null,null,null,null,null,null,null,null,null,null,null,null,null,{"$f":"IF(R36=\"\",\"\",VLOOKUP(R36,Planning_général!$E$55:$F$62,2,0))","v":""},{"$f":"IF(W36=1,$W$3,IF(X36=1,$X$3,IF(Y36=1,$Y$3,IF(Z36=1,Z3,IF(AA36=1,$AA$3,IF(AB36=1,$AB$3,IF(AC36=1,$AC$3,IF(AD36=1,$AD$3,IF(AE36=1,$AE$3,IF(AF36=1,$AF$3,IF(AG36=1,$AG$3,IF(AH36=1,AH3,IF(AI36=1,$AI$3,IF(AJ36=1,$AJ$3,IF(AK36=1,$AK$3,\"\")))))))))))))))","v":""},{"$f":"IF(U36=1,U$9,IF(V36=1,V$9,IF(W36=1,W$9,IF(X36=1,X$9,IF(Y36=1,Y$9,IF(Z36=1,Z$9,IF(AA36=1,AA$9,IF(AB36=1,AB$9,IF(AC36=1,AC$9,IF(AD36=1,AD$9,IF(AE36=1,AE$9,\"\")))))))))))","v":""},null,null,"M2",null,{"$f":"IF(AND(X$30=$V$36,W36=\"\",X35=\"\"),1,\"\")","v":""},{"$f":"IF(AND(Y$30=$V$36,X36=\"\",Y35=\"\"),1,\"\")","v":""},{"$f":"IF(AND(Z$30=$V$36,Y36=\"\",Z35=\"\"),1,\"\")","v":""},{"$f":"IF(AND(AA$30=$V$36,AA35=\"\",SUM($X$36:Z36)=0),1,\"\")","v":""},{"$f":"IF(AND(AB$30=$V$36,AB35=\"\",SUM($X$36:AA36)=0),1,\"\")","v":""},{"$f":"IF(AND(AC$30=$V$36,AC35=\"\",SUM($X$36:AB36)=0),1,\"\")","v":""},{"$f":"IF(AND(AD$30=$V$36,AD35=\"\",SUM($X$36:AC36)=0),1,\"\")","v":""},{"$f":"IF(AND(AE$30=$V$36,AE35=\"\",SUM($X$36:AD36)=0),1,\"\")","v":""},{"$f":"IF(AND(AF$30=$V$36,AF35=\"\",SUM($X$36:AE36)=0),1,\"\")","v":""},{"$f":"IF(AND(AG$30=$V$36,AG35=\"\",SUM($X$36:AF36)=0),1,\"\")","v":""},{"$f":"IF(AND(AH$30=$V$36,AH35=\"\",SUM($X$36:AG36)=0),1,\"\")","v":""},{"$f":"IF(AND(AI$30=$V$36,AI35=\"\",SUM($X$36:AH36)=0),1,\"\")","v":""},{"$f":"IF(AND(AJ$30=$V$36,AJ35=\"\",SUM($X$36:AI36)=0),1,\"\")","v":""},{"$f":"IF(AND(AK$30=$V$36,AK35=\"\",SUM($X$36:AJ36)=0),1,\"\")","v":""}]
[null,null,null,null,null,null,null,null,null,null,null,null,null,null,null,null,{"$f":"IF(R37=\"\",\"\",VLOOKUP(R37,Planning_général!$E$55:$F$62,2,0))","v":""},{"$f":"IF(W37=1,$W$3,IF(X37=1,$X$3,IF(Y37=1,$Y$3,IF(Z37=1,$Z$3,IF(AA37=1,$AA$3,IF(AB37=1,$AB$3,IF(AC37=1,$AC$3,IF(AD37=1,$AD$3,IF(AE37=1,$AE$3,IF(AF37=1,$AF$3,IF(AG37=1,$AG$3,IF(AH37=1,$AH$3,IF(AI37=1,$AI$3,IF(AJ37=1,$AJ$3,IF(AK37=1,$AK$3,\"\")))))))))))))))","v":""},{"$f":"IF(U37=1,U$9,IF(V37=1,V$9,IF(W37=1,W$9,IF(X37=1,X$9,IF(Y37=1,Y$9,IF(Z37=1,Z$9,IF(AA37=1,AA$9,IF(AB37=1,AB$9,IF(AC37=1,AC$9,IF(AD37=1,AD$9,IF(AE37=1,AE$9,\"\")))))))))))","v":""},null,null,"-",null,null,{"$f":"IF(AND(Y$30=V37,X37=\"\",Y36=\"\",Y35=\"\"),1,\"\")","v":""},{"$f":"IF(AND(Z$30=V37,Y37=\"\",Z36=\"\",Z35=\"\"),1,\"\")","v":""},{"$f":"IF(AND(AA$30=$V$37,AA35=\"\",AA36=\"\",SUM($Y$37:Z37)=0),1,\"\")","v":""},{"$f":"IF(AND(AB$30=$V$37,AB35=\"\",AB36=\"\",SUM($Y$37:AA37)=0),1,\"\")","v":""},{"$f":"IF(AND(AC$30=$V$37,AC35=\"\",AC36=\"\",SUM($Y$37:AB37)=0),1,\"\")","v":""},{"$f":"IF(AND(AD$30=$V$37,AD35=\"\",AD36=\"\",SUM($Y$37:AC37)=0),1,\"\")","v":""},{"$f":"IF(AND(AE$30=$V$37,AE35=\"\",AE36=\"\",SUM($Y$37:AD37)=0),1,\"\")","v":""},{"$f":"IF(AND(AF$30=$V$37,AF35=\"\",AF36=\"\",SUM($Y$37:AE37)=0),1,\"\")","v":""},{"$f":"IF(AND(AG$30=$V$37,AG35=\"\",AG36=\"\",SUM($Y$37:AF37)=0),1,\"\")","v":""},{"$f":"IF(AND(AH$30=$V$37,AH35=\"\",AH36=\"\",SUM($Y$37:AG37)=0),1,\"\")","v":""},{"$f":"IF(AND(AI$30=$V$37,AI35=\"\",AI36=\"\",SUM($Y$37:AH37)=0),1,\"\")","v":""},{"$f":"IF(AND(AJ$30=$V$37,AJ35=\"\",AJ36=\"\",SUM($Y$37:AI37)=0),1,\"\")","v":""},{"$f":"IF(AND(AK$30=$V$37,AK35=\"\",AK36=\"\",SUM($Y$37:AJ37)=0),1,\"\")","v":""},null,null,null,null,null,null,null,null,null,null,null,null,null,null,null,null,null,null,30]
[null,null,null,null,null,null,null,null,null,null,null,null,null,null,null,null,null,null,null,null,null,null,null,null,null,null,null,null,null,null,null,null,null,null,null,null,null,null,null,null,null,null,null,null,null,null,null,null,null,null,null,null,null,null,null,31]
[null,null,null,null,null,null,null,null,null,null,null,null,null,null,null,null,null,null,null,null,null,null,null,null,null,null,null,null,null,null,null,null,null,null,null,null,null,null,null,null,null,null,null,null,null,null,null,null,null,null,null,null,null,null,null,35]
[null,null,null,null,null,null,null,null,null,null,null,null,null,null,null,null,{"$f":"IF(R40=\"\",\"\",VLOOKUP(R40,Planning_général!$E$55:$F$62,2,0))","v":""},{"$f":"IF(W40=1,$W$3,IF(X40=1,$X$3,IF(Y40=1,$Y$3,IF(Z40=1,Z3,IF(AA40=1,$AA$3,IF(AB40=1,$AB$3,IF(AC40=1,$AC$3,IF(AD40=1,$AD$3,IF(AE40=1,$AE$3,IF(AF40=1,$AF$3,IF(AG40=1,$AG$3,IF(AH40=1,AH12,IF(AI40=1,$AI$3,IF(AJ40=1,$AJ$3,IF(AK40=1,$AK$3,\"\")))))))))))))))","v":""},{"$f":"IF(U40=1,U$9,IF(V40=1,V$9,IF(W40=1,W$9,IF(X40=1,X$9,IF(Y40=1,Y$9,IF(Z40=1,Z$9,IF(AA40=1,AA$9,IF(AB40=1,AB$9,IF(AC40=1,AC$9,IF(AD40=1,AD$9,IF(AE40=1,AE$9,\"\")))))))))))","v":""},"Jrnée 1",null,"J1",{"$f":"IF($V$40=$W$30,1,\"\")","v":""},{"$f":"IF(AND($V$40=$X$30,W40=\"\"),1,\"\")","v":""},{"$f":"IF(AND($V$40=$Y$30,X40=\"\",W40=\"\"),1,\"\")","v":""},{"$f":"IF(AND($V$40=Z30,W40=\"\",X40=\"\",Y40=\"\"),1,\"\")","v":""},{"$f":"IF(AND($V$40=$AA$30,X40=\"\",Y40=\"\",Z40=\"\",W40=\"\"),1,\"\")","v":""},{"$f":"IF(AND($V$40=$AB$30,Y40=\"\",Z40=\"\",AA40=\"\",X40=\"\",W40=\"\"),1,\"\")","v":""},{"$f":"IF(AND($V$40=AC30,Z40=\"\",AA40=\"\",AB40=\"\",Y40=\"\",X40=\"\",W40=\"\"),1,\"\")","v":""},{"$f":"IF(AND($V$40=AD30,AA40=\"\",AB40=\"\",AC40=\"\",Z40=\"\",Y40=\"\",X40=\"\",W40=\"\"),1,\"\")","v":""},{"$f":"IF(AND($V$40=$AE$30,AB40=\"\",AC40=\"\",AD40=\"\",AA40=\"\",Z40=\"\",Y40=\"\",X40=\"\",W40=\"\"),1,\"\")","v":""},{"$f":"IF(AND($V$40=$AF$30,AC40=\"\",AD40=\"\",AE40=\"\",AB40=\"\",AA40=\"\",Z40=\"\",Y40=\"\",X40=\"\",W40=\"\"),1,\"\")","v":""},{"$f":"IF(AND($V$40=$AG$30,AD40=\"\",AE40=\"\",AF40=\"\",AC40=\"\",AB40=\"\",AA40=\"\",Z40=\"\",Y40=\"\",X40=\"\",W40=\"\"),1,\"\")","v":""},{"$f":"IF(AND($V$40=$AH$30,AE40=\"\",AF40=\"\",AG40=\"\",AD40=\"\",AC40=\"\",AB40=\"\",AA40=\"\",Z40=\"\",Y40=\"\",X40=\"\",W40=\"\"),1,\"\")","v":""},{"$f":"IF(AND($V$40=$AI$30,AF40=\"\",AG40=\"\",AH40=\"\",AE40=\"\",AD40=\"\",AC40=\"\",AB40=\"\",AA40=\"\",Z40=\"\",Y40=\"\",X40=\"\",W40=\"\"),1,\"\")","v":""},{"$f":"IF(AND($V$40=$AJ$30,AG40=\"\",AH40=\"\",AI40=\"\",AF40=\"\",AE40=\"\",AD40=\"\",AC40=\"\",AB40=\"\",AA40=\"\",Z40=\"\",Y40=\"\",X40=\"\",W40=\"\"),1,\"\")","v":""},{"$f":"IF(AND($V$40=$AK$30,AH40=\"\",AI40=\"\",AJ40=\"\",AG40=\"\",AF40=\"\",AE40=\"\",AD40=\"\",AC40=\"\",AB40=\"\",AA40=\"\",Z40=\"\",Y40=\"\",X40=\"\",W40=\"\"),1,\"\")","v":""},null,null,null,null,null,null,null,null,null,null,null,null,null,null,null,null,null,null,36]
[null,null,null,null,null,null,null,null,null,null,null,null,null,null,null,null,{"$f":"IF(R41=\"\",\"\",VLOOKUP(R41,Planning_général!$E$55:$F$62,2,0))","v":""},{"$f":"IF(W41=1,$W$3,IF(X41=1,$X$3,IF(Y41=1,$Y$3,IF(Z41=1,$Z$3,IF(AA41=1,$AA$3,IF(AB41=1,$AB$3,IF(AC41=1,$AC$3,IF(AD41=1,$AD$3,IF(AE41=1,$AE$3,IF(AF41=1,$AF$3,IF(AG41=1,$AG$3,IF(AH41=1,$AH$3,IF(AI41=1,$AI$3,IF(AJ41=1,$AJ$3,IF(AK41=1,$AK$3,\"\")))))))))))))))","v":""},{"$f":"IF(U41=1,U$9,IF(V41=1,V$9,IF(W41=1,W$9,IF(X41=1,X$9,IF(Y41=1,Y$9,IF(Z41=1,Z$9,IF(AA41=1,AA$9,IF(AB41=1,AB$9,IF(AC41=1,AC$9,IF(AD41=1,AD$9,IF(AE41=1,AE$9,\"\")))))))))))","v":""},null,null,"J1",null,{"$f":"IF(AND(X$30=$V$41,W41=\"\",X40=\"\"),1,\"\")","v":""},{"$f":"IF(AND(Y$30=$V$41,X41=\"\",Y40=\"\"),1,\"\")","v":""},{"$f":"IF(AND(Z$30=$V$41,Y41=\"\",Z40=\"\"),1,\"\")","v":""},{"$f":"IF(AND(AA$30=$V$41,AA40=\"\",SUM($X$41:Z41)=0),1,\"\")","v":""},{"$f":"IF(AND(AB$30=$V$41,AB40=\"\",SUM($X$41:AA41)=0),1,\"\")","v":""},{"$f":"IF(AND(AC$30=$V$41,AC40=\"\",SUM($X$41:AB41)=0),1,\"\")","v":""},{"$f":"IF(AND(AD$30=$V$41,AD40=\"\",SUM($X$41:AC41)=0),1,\"\")","v":""},{"$f":"IF(AND(AE$30=$V$41,AE40=\"\",SUM($X$41:AD41)=0),1,\"\")","v":""},{"$f":"IF(AND(AF$30=$V$41,AF40=\"\",SUM($X$41:AE41)=0),1,\"\")","v":""},{"$f":"IF(AND(AG$30=$V$41,AG40=\"\",SUM($X$41:AF41)=0),1,\"\")","v":""},{"$f":"IF(AND(AH$30=$V$41,AH40=\"\",SUM($X$41:AG41)=0),1,\"\")","v":""},{"$f":"IF(AND(AI$30=$V$41,AI40=\"\",SUM($X$41:AH41)=0),1,\"\")","v":""},{"$f":"IF(AND(AJ$30=$V$41,AJ40=\"\",SUM($X$41:AI41)=0),1,\"\")","v":""},{"$f":"IF(AND(AK$30=$V$41,AK40=\"\",SUM($X$41:AJ41)=0),1,\"\")","v":""},null,null,null,null,null,null,null,null,null,null,null,null,null,null,null,null,null,null,37]
[null,null,null,null,null,null,null,null,null,null,null,null,null,null,null,null,{"$f":"IF(R42=\"\",\"\",VLOOKUP(R42,Planning_général!$E$55:$F$62,2,0))","v":""},{"$f":"IF(W42=1,$W$3,IF(X42=1,$X$3,IF(Y42=1,$Y$3,IF(Z42=1,Z10,IF(AA42=1,$AA$3,IF(AB42=1,$AB$3,IF(AC42=1,$AC$3,IF(AD42=1,$AD$3,IF(AE42=1,$AE$3,IF(AF42=1,$AF$3,IF(AG42=1,$AG$3,IF(AH42=1,$AH$3,IF(AI42=1,$AI$3,IF(AJ42=1,$AJ$3,IF(AK42=1,$AK$3,\"\")))))))))))))))","v":""},{"$f":"IF(U42=1,U$9,IF(V42=1,V$9,IF(W42=1,W$9,IF(X42=1,X$9,IF(Y42=1,Y$9,IF(Z42=1,Z$9,IF(AA42=1,AA$9,IF(AB42=1,AB$9,IF(AC42=1,AC$9,IF(AD42=1,AD$9,IF(AE42=1,AE$9,\"\")))))))))))","v":""},null,null,"-",null,null,{"$f":"IF(AND(Y$30=V42,X42=\"\",Y41=\"\",Y40=\"\"),1,\"\")","v":""},{"$f":"IF(AND(Z$30=V42,Y42=\"\",Z41=\"\",Z40=\"\"),1,\"\")","v":""},{"$f":"IF(AND(AA$30=$V$42,AA40=\"\",AA41=\"\",SUM($Y$42:Z42)=0),1,\"\")","v":""},{"$f":"IF(AND(AB$30=$V$42,AB40=\"\",AB41=\"\",SUM($Y$42:AA42)=0),1,\"\")","v":""},{"$f":"IF(AND(AC$30=$V$42,AC40=\"\",AC41=\"\",SUM($Y$42:AB42)=0),1,\"\")","v":""},{"$f":"IF(AND(AD$30=$V$42,AD40=\"\",AD41=\"\",SUM($Y$42:AC42)=0),1,\"\")","v":""},{"$f":"IF(AND(AE$30=$V$42,AE40=\"\",AE41=\"\",SUM($Y$42:AD42)=0),1,\"\")","v":""},{"$f":"IF(AND(AF$30=$V$42,AF40=\"\",AF41=\"\",SUM($Y$42:AE42)=0),1,\"\")","v":""},{"$f":"IF(AND(AG$30=$V$42,AG40=\"\",AG41=\"\",SUM($Y$42:AF42)=0),1,\"\")","v":""},{"$f":"IF(AND(AH$30=$V$42,AH40=\"\",AH41=\"\",SUM($Y$42:AG42)=0),1,\"\")","v":""},{"$f":"IF(AND(AI$30=$V$42,AI40=\"\",AI41=\"\",SUM($Y$42:AH42)=0),1,\"\")","v":""},{"$f":"IF(AND(AJ$30=$V$42,AJ40=\"\",AJ41=\"\",SUM($Y$42:AI42)=0),1,\"\")","v":""},{"$f":"IF(AND(AK$30=$V$42,AK40=\"\",AK41=\"\",SUM($Y$42:AJ42)=0),1,\"\")","v":""},null,null,null,null,null,null,null,null,null,null,null,null,null,null,null,null,null,null,38]
[null,null,null,null,null,null,null,null,null,null,null,null,null,null,null,null,null,null,null,null,null,null,null,null,null,null,null,null,null,null,null,null,null,null,null,null,null,null,null,null,null,null,null,null,null,null,null,null,null,null,null,null,null,null,null,39]
[null,null,null,null,null,null,null,null,null,null,null,null,null,null,null,null,null,null,null,null,null,null,null,null,null,null,null,null,null,null,null,null,null,null,null,null,null,null,null,null,null,null,null,null,null,null,null,null,null,null,null,null,null,null,null,40]
[null,null,null,null,null,null,null,null,null,null,null,null,null,null,null,null,{"$f":"IF(R45=\"\",\"\",VLOOKUP(R45,Planning_général!$E$55:$F$62,2,0))","v":""},{"$f":"IF(W45=1,$W$3,IF(X45=1,$X$3,IF(Y45=1,$Y$3,IF(Z45=1,Z3,IF(AA45=1,$AA$3,IF(AB45=1,$AB$3,IF(AC45=1,$AC$3,IF(AD45=1,$AD$3,IF(AE45=1,$AE$3,IF(AF45=1,$AF$3,IF(AG45=1,$AG$3,IF(AH45=1,AH3,IF(AI45=1,$AI$3,IF(AJ45=1,$AJ$3,IF(AK45=1,$AK$3,\"\")))))))))))))))","v":""},{"$f":"IF(U45=1,U$9,IF(V45=1,V$9,IF(W45=1,W$9,IF(X45=1,X$9,IF(Y45=1,Y$9,IF(Z45=1,Z$9,IF(AA45=1,AA$9,IF(AB45=1,AB$9,IF(AC45=1,AC$9,IF(AD45=1,AD$9,IF(AE45=1,AE$9,\"\")))))))))))","v":""},"Jrnée 2",null,"J2",{"$f":"IF($V$45=$W$30,1,\"\")","v":""},{"$f":"IF(AND($V$45=$X$30,W45=\"\"),1,\"\")","v":""},{"$f":"IF(AND($V$45=$Y$30,X45=\"\",W45=\"\"),1,\"\")","v":""},{"$f":"IF(AND($V$45=Z30,W45=\"\",X45=\"\",Y45=\"\"),1,\"\")","v":""},{"$f":"IF(AND($V$45=$AA$30,X45=\"\",Y45=\"\",Z45=\"\",W45=\"\"),1,\"\")","v":""},{"$f":"IF(AND($V$45=$AB$30,Y45=\"\",Z45=\"\",AA45=\"\",X45=\"\",W45=\"\"),1,\"\")","v":""},{"$f":"IF(AND($V$45=AC35,Z45=\"\",AA45=\"\",AB45=\"\",Y45=\"\",X45=\"\",W45=\"\"),1,\"\")","v":""},{"$f":"IF(AND($V$45=AD35,AA45=\"\",AB45=\"\",AC45=\"\",Z45=\"\",Y45=\"\",X45=\"\",W45=\"\"),1,\"\")","v":""},{"$f":"IF(AND($V$45=$AE$30,AB45=\"\",AC45=\"\",AD45=\"\",AA45=\"\",Z45=\"\",Y45=\"\",X45=\"\",W45=\"\"),1,\"\")","v":""},{"$f":"IF(AND($V$45=$AF$30,AC45=\"\",AD45=\"\",AE45=\"\",AB45=\"\",AA45=\"\",Z45=\"\",Y45=\"\",X45=\"\",W45=\"\"),1,\"\")","v":""},{"$f":"IF(AND($V$45=$AG$30,AD45=\"\",AE45=\"\",AF45=\"\",AC45=\"\",AB45=\"\",AA45=\"\",Z45=\"\",Y45=\"\",X45=\"\",W45=\"\"),1,\"\")","v":""},{"$f":"IF(AND($V$45=$AH$30,AE45=\"\",AF45=\"\",AG45=\"\",AD45=\"\",AC45=\"\",AB45=\"\",AA45=\"\",Z45=\"\",Y45=\"\",X45=\"\",W45=\"\"),1,\"\")","v":""},{"$f":"IF(AND($V$45=$AI$30,AF45=\"\",AG45=\"\",AH45=\"\",AE45=\"\",AD45=\"\",AC45=\"\",AB45=\"\",AA45=\"\",Z45=\"\",Y45=\"\",X45=\"\",W45=\"\"),1,\"\")","v":""},{"$f":"IF(AND($V$45=$AJ$30,AG45=\"\",AH45=\"\",AI45=\"\",AF45=\"\",AE45=\"\",AD45=\"\",AC45=\"\",AB45=\"\",AA45=\"\",Z45=\"\",Y45=\"\",X45=\"\",W45=\"\"),1,\"\")","v":""},{"$f":"IF(AND($V$45=$AK$30,AH45=\"\",AI45=\"\",AJ45=\"\",AG45=\"\",AF45=\"\",AE45=\"\",AD45=\"\",AC45=\"\",AB45=\"\",AA45=\"\",Z45=\"\",Y45=\"\",X45=\"\",W45=\"\"),1,\"\")","v":""},null,null,null,null,null,null,null,null,null,null,null,null,null,null,null,null,null,null,41]
[null,null,null,null,null,null,null,null,null,null,null,null,null,null,null,null,{"$f":"IF(R46=\"\",\"\",VLOOKUP(R46,Planning_général!$E$55:$F$62,2,0))","v":""},{"$f":"IF(W46=1,$W$3,IF(X46=1,$X$3,IF(Y46=1,$Y$3,IF(Z46=1,$Z$3,IF(AA46=1,$AA$3,IF(AB46=1,$AB$3,IF(AC46=1,$AC$3,IF(AD46=1,$AD$3,IF(AE46=1,$AE$3,IF(AF46=1,$AF$3,IF(AG46=1,$AG$3,IF(AH46=1,$AH$3,IF(AI46=1,$AI$3,IF(AJ46=1,$AJ$3,IF(AK46=1,$AK$3,\"\")))))))))))))))","v":""},{"$f":"IF(U46=1,U$9,IF(V46=1,V$9,IF(W46=1,W$9,IF(X46=1,X$9,IF(Y46=1,Y$9,IF(Z46=1,Z$9,IF(AA46=1,AA$9,IF(AB46=1,AB$9,IF(AC46=1,AC$9,IF(AD46=1,AD$9,IF(AE46=1,AE$9,\"\")))))))))))","v":""},null,null,"J2",null,{"$f":"IF(AND(X$30=$V$46,W46=\"\",X45=\"\"),1,\"\")","v":""},{"$f":"IF(AND(Y$30=$V$46,X46=\"\",Y45=\"\"),1,\"\")","v":""},{"$f":"IF(AND(Z$30=$V$46,Y46=\"\",Z45=\"\"),1,\"\")","v":""},{"$f":"IF(AND(AA$30=$V$46,AA45=\"\",SUM($X$46:Z46)=0),1,\"\")","v":""},{"$f":"IF(AND(AB$30=$V$46,AB45=\"\",SUM($X$46:AA46)=0),1,\"\")","v":""},{"$f":"IF(AND(AC$30=$V$46,AC45=\"\",SUM($X$46:AB46)=0),1,\"\")","v":""},{"$f":"IF(AND(AD$30=$V$46,AD45=\"\",SUM($X$46:AC46)=0),1,\"\")","v":""},{"$f":"IF(AND(AE$30=$V$46,AE45=\"\",SUM($X$46:AD46)=0),1,\"\")","v":""},{"$f":"IF(AND(AF$30=$V$46,AF45=\"\",SUM($X$46:AE46)=0),1,\"\")","v":""},{"$f":"IF(AND(AG$30=$V$46,AG45=\"\",SUM($X$46:AF46)=0),1,\"\")","v":""},{"$f":"IF(AND(AH$30=$V$46,AH45=\"\",SUM($X$46:AG46)=0),1,\"\")","v":""},{"$f":"IF(AND(AI$30=$V$46,AI45=\"\",SUM($X$46:AH46)=0),1,\"\")","v":""},{"$f":"IF(AND(AJ$30=$V$46,AJ45=\"\",SUM($X$46:AI46)=0),1,\"\")","v":""},{"$f":"IF(AND(AK$30=$V$46,AK45=\"\",SUM($X$46:AJ46)=0),1,\"\")","v":""},null,null,null,null,null,null,null,null,null,null,null,null,null,null,null,null,null,null,42]
[null,null,null,null,null,null,null,null,null,null,null,null,null,null,null,null,{"$f":"IF(R47=\"\",\"\",VLOOKUP(R47,Planning_général!$E$55:$F$62,2,0))","v":""},{"$f":"IF(W47=1,$W$3,IF(X47=1,$X$3,IF(Y47=1,$Y$3,IF(Z47=1,$Z$3,IF(AA47=1,$AA$3,IF(AB47=1,$AB$3,IF(AC47=1,$AC$3,IF(AD47=1,$AD$3,IF(AE47=1,$AE$3,IF(AF47=1,$AF$3,IF(AG47=1,$AG$3,IF(AH47=1,$AH$3,IF(AI47=1,$AI$3,IF(AJ47=1,$AJ$3,IF(AK47=1,$AK$3,\"\")))))))))))))))","v":""},{"$f":"IF(U47=1,U$9,IF(V47=1,V$9,IF(W47=1,W$9,IF(X47=1,X$9,IF(Y47=1,Y$9,IF(Z47=1,Z$9,IF(AA47=1,AA$9,IF(AB47=1,AB$9,IF(AC47=1,AC$9,IF(AD47=1,AD$9,IF(AE47=1,AE$9,\"\")))))))))))","v":""},null,null,"-",null,null,{"$f":"IF(AND(Y$30=V47,X47=\"\",Y46=\"\",Y45=\"\"),1,\"\")","v":""},{"$f":"IF(AND(Z$30=V47,Y47=\"\",Z46=\"\",Z45=\"\"),1,\"\")","v":""},{"$f":"IF(AND(AA$30=$V$47,AA45=\"\",AA46=\"\",SUM($Y$47:Z47)=0),1,\"\")","v":""},{"$f":"IF(AND(AB$30=$V$47,AB45=\"\",AB46=\"\",SUM($Y$47:AA47)=0),1,\"\")","v":""},{"$f":"IF(AND(AC$30=$V$47,AC45=\"\",AC46=\"\",SUM($Y$47:AB47)=0),1,\"\")","v":""},{"$f":"IF(AND(AD$30=$V$47,AD45=\"\",AD46=\"\",SUM($Y$47:AC47)=0),1,\"\")","v":""},{"$f":"IF(AND(AE$30=$V$47,AE45=\"\",AE46=\"\",SUM($Y$47:AD47)=0),1,\"\")","v":""},{"$f":"IF(AND(AF$30=$V$47,AF45=\"\",AF46=\"\",SUM($Y$47:AE47)=0),1,\"\")","v":""},{"$f":"IF(AND(AG$30=$V$47,AG45=\"\",AG46=\"\",SUM($Y$47:AF47)=0),1,\"\")","v":""},{"$f":"IF(AND(AH$30=$V$47,AH45=\"\",AH46=\"\",SUM($Y$47:AG47)=0),1,\"\")","v":""},{"$f":"IF(AND(AI$30=$V$47,AI45=\"\",AI46=\"\",SUM($Y$47:AH47)=0),1,\"\")","v":""},{"$f":"IF(AND(AJ$30=$V$47,AJ45=\"\",AJ46=\"\",SUM($Y$47:AI47)=0),1,\"\")","v":""},{"$f":"IF(AND(AK$30=$V$47,AK45=\"\",AK46=\"\",SUM($Y$47:AJ47)=0),1,\"\")","v":""},null,null,null,null,null,null,null,null,null,null,null,null,null,null,null,null,null,null,43]
[null,null,null,null,null,null,null,null,null,null,null,null,null,null,null,null,null,null,null,null,null,null,null,null,null,null,null,null,null,null,null,null,null,null,null,null,null,null,null,null,null,null,null,null,null,null,null,null,null,null,null,null,null,null,null,44]
[null,null,null,null,null,null,null,null,null,null,null,null,null,null,null,null,null,null,null,null,null,null,null,null,null,null,null,null,null,null,null,null,null,null,null,null,null,null,null,null,null,null,null,null,null,null,null,null,null,null,null,null,null,null,null,45]
[null,null,null,null,null,null,null,null,null,null,null,null,null,null,null,null,{"$f":"IF(R50=\"\",\"\",VLOOKUP(R50,Planning_général!$E$55:$F$62,2,0))","v":""},{"$f":"IF(W50=1,$W$3,IF(X50=1,$X$3,IF(Y50=1,$Y$3,IF(Z50=1,$Z$3,IF(AA50=1,$AA$3,IF(AB50=1,$AB$3,IF(AC50=1,$AC$3,IF(AD50=1,$AD$3,IF(AE50=1,$AE$3,IF(AF50=1,$AF$3,IF(AG50=1,$AG$3,IF(AH50=1,$AH$3,IF(AI50=1,$AI$3,IF(AJ50=1,$AJ$3,IF(AK50=1,$AK$3,\"\")))))))))))))))","v":""},{"$f":"IF(U50=1,U$9,IF(V50=1,V$9,IF(W50=1,W$9,IF(X50=1,X$9,IF(Y50=1,Y$9,IF(Z50=1,Z$9,IF(AA50=1,AA$9,IF(AB50=1,AB$9,IF(AC50=1,AC$9,IF(AD50=1,AD$9,IF(AE50=1,AE$9,\"\")))))))))))","v":""},"Jrnée 3",null,"J3",{"$f":"IF($V$50=$W$30,1,\"\")","v":""},{"$f":"IF(AND($V$50=$X$30,W50=\"\"),1,\"\")","v":""},{"$f":"IF(AND($V$50=$Y$30,X50=\"\",W50=\"\"),1,\"\")","v":""},{"$f":"IF(AND($V$50=Z30,W50=\"\",X50=\"\",Y50=\"\"),1,\"\")","v":""},{"$f":"IF(AND($V$50=$AA$30,X50=\"\",Y50=\"\",Z50=\"\",W50=\"\"),1,\"\")","v":""},{"$f":"IF(AND($V$50=$AB$30,Y50=\"\",Z50=\"\",AA50=\"\",X50=\"\",W50=\"\"),1,\"\")","v":""},{"$f":"IF(AND($V$50=AC40,Z50=\"\",AA50=\"\",AB50=\"\",Y50=\"\",X50=\"\",W50=\"\"),1,\"\")","v":""},{"$f":"IF(AND($V$50=AD40,AA50=\"\",AB50=\"\",AC50=\"\",Z50=\"\",Y50=\"\",X50=\"\",W50=\"\"),1,\"\")","v":""},{"$f":"IF(AND($V$50=$AE$30,AB50=\"\",AC50=\"\",AD50=\"\",AA50=\"\",Z50=\"\",Y50=\"\",X50=\"\",W50=\"\"),1,\"\")","v":""},{"$f":"IF(AND($V$50=$AF$30,AC50=\"\",AD50=\"\",AE50=\"\",AB50=\"\",AA50=\"\",Z50=\"\",Y50=\"\",X50=\"\",W50=\"\"),1,\"\")","v":""},{"$f":"IF(AND($V$50=$AG$30,AD50=\"\",AE50=\"\",AF50=\"\",AC50=\"\",AB50=\"\",AA50=\"\",Z50=\"\",Y50=\"\",X50=\"\",W50=\"\"),1,\"\")","v":""},{"$f":"IF(AND($V$50=$AH$30,AE50=\"\",AF50=\"\",AG50=\"\",AD50=\"\",AC50=\"\",AB50=\"\",AA50=\"\",Z50=\"\",Y50=\"\",X50=\"\",W50=\"\"),1,\"\")","v":""},{"$f":"IF(AND($V$50=$AI$30,AF50=\"\",AG50=\"\",AH50=\"\",AE50=\"\",AD50=\"\",AC50=\"\",AB50=\"\",AA50=\"\",Z50=\"\",Y50=\"\",X50=\"\",W50=\"\"),1,\"\")","v":""},{"$f":"IF(AND($V$50=$AJ$30,AG50=\"\",AH50=\"\",AI50=\"\",AF50=\"\",AE50=\"\",AD50=\"\",AC50=\"\",AB50=\"\",AA50=\"\",Z50=\"\",Y50=\"\",X50=\"\",W50=\"\"),1,\"\")","v":""},{"$f":"IF(AND($V$50=$AK$30,AH50=\"\",AI50=\"\",AJ50=\"\",AG50=\"\",AF50=\"\",AE50=\"\",AD50=\"\",AC50=\"\",AB50=\"\",AA50=\"\",Z50=\"\",Y50=\"\",X50=\"\",W50=\"\"),1,\"\")","v":""},null,null,null,null,null,null,null,null,null,null,null,null,null,null,null,null,null,null,46]
[null,null,null,null,null,null,null,null,null,null,null,null,null,null,null,null,{"$f":"IF(R51=\"\",\"\",VLOOKUP(R51,Planning_général!$E$55:$F$62,2,0))","v":""},{"$f":"IF(W51=1,$W$3,IF(X51=1,$X$3,IF(Y51=1,$Y$3,IF(Z51=1,$Z$3,IF(AA51=1,$AA$3,IF(AB51=1,$AB$3,IF(AC51=1,$AC$3,IF(AD51=1,$AD$3,IF(AE51=1,$AE$3,IF(AF51=1,$AF$3,IF(AG51=1,$AG$3,IF(AH51=1,$AH$3,IF(AI51=1,$AI$3,IF(AJ51=1,$AJ$3,IF(AK51=1,$AK$3,\"\")))))))))))))))","v":""},{"$f":"IF(U51=1,U$9,IF(V51=1,V$9,IF(W51=1,W$9,IF(X51=1,X$9,IF(Y51=1,Y$9,IF(Z51=1,Z$9,IF(AA51=1,AA$9,IF(AB51=1,AB$9,IF(AC51=1,AC$9,IF(AD51=1,AD$9,IF(AE51=1,AE$9,\"\")))))))))))","v":""},null,null,"J3",null,{"$f":"IF(AND(X$30=$V$51,W51=\"\",X50=\"\"),1,\"\")","v":""},{"$f":"IF(AND(Y$30=$V$51,X51=\"\",Y50=\"\"),1,\"\")","v":""},{"$f":"IF(AND(Z$30=$V$51,Y51=\"\",Z50=\"\"),1,\"\")","v":""},{"$f":"IF(AND(AA$30=$V$51,AA50=\"\",SUM($X$51:Z51)=0),1,\"\")","v":""},{"$f":"IF(AND(AB$30=$V$51,AB50=\"\",SUM($X$51:AA51)=0),1,\"\")","v":""},{"$f":"IF(AND(AC$30=$V$51,AC50=\"\",SUM($X$51:AB51)=0),1,\"\")","v":""},{"$f":"IF(AND(AD$30=$V$51,AD50=\"\",SUM($X$51:AC51)=0),1,\"\")","v":""},{"$f":"IF(AND(AE$30=$V$51,AE50=\"\",SUM($X$51:AD51)=0),1,\"\")","v":""},{"$f":"IF(AND(AF$30=$V$51,AF50=\"\",SUM($X$51:AE51)=0),1,\"\")","v":""},{"$f":"IF(AND(AG$30=$V$51,AG50=\"\",SUM($X$51:AF51)=0),1,\"\")","v":""},{"$f":"IF(AND(AH$30=$V$51,AH50=\"\",SUM($X$51:AG51)=0),1,\"\")","v":""},{"$f":"IF(AND(AI$30=$V$51,AI50=\"\",SUM($X$51:AH51)=0),1,\"\")","v":""},{"$f":"IF(AND(AJ$30=$V$51,AJ50=\"\",SUM($X$51:AI51)=0),1,\"\")","v":""},{"$f":"IF(AND(AK$30=$V$51,AK50=\"\",SUM($X$51:AJ51)=0),1,\"\")","v":""},null,null,null,null,null,null,null,null,null,null,null,null,null,null,null,null,null,null,47]
[null,null,null,null,null,null,null,null,null,null,null,null,null,null,null,null,{"$f":"IF(R52=\"\",\"\",VLOOKUP(R52,Planning_général!$E$55:$F$62,2,0))","v":""},{"$f":"IF(W52=1,$W$3,IF(X52=1,$X$3,IF(Y52=1,$Y$3,IF(Z52=1,$Z$3,IF(AA52=1,$AA$3,IF(AB52=1,$AB$3,IF(AC52=1,$AC$3,IF(AD52=1,$AD$3,IF(AE52=1,$AE$3,IF(AF52=1,$AF$3,IF(AG52=1,$AG$3,IF(AH52=1,$AH$3,IF(AI52=1,$AI$3,IF(AJ52=1,$AJ$3,IF(AK52=1,$AK$3,\"\")))))))))))))))","v":""},{"$f":"IF(U52=1,U$9,IF(V52=1,V$9,IF(W52=1,W$9,IF(X52=1,X$9,IF(Y52=1,Y$9,IF(Z52=1,Z$9,IF(AA52=1,AA$9,IF(AB52=1,AB$9,IF(AC52=1,AC$9,IF(AD52=1,AD$9,IF(AE52=1,AE$9,\"\")))))))))))","v":""},null,null,"-",null,null,{"$f":"IF(AND(Y$30=V52,X52=\"\",Y51=\"\",Y50=\"\"),1,\"\")","v":""},{"$f":"IF(AND(Z$30=V52,Y52=\"\",Z51=\"\",Z50=\"\"),1,\"\")","v":""},{"$f":"IF(AND(AA$30=$V$52,AA50=\"\",AA51=\"\",SUM($Y$52:Z52)=0),1,\"\")","v":""},{"$f":"IF(AND(AB$30=$V$52,AB50=\"\",AB51=\"\",SUM($Y$52:AA52)=0),1,\"\")","v":""},{"$f":"IF(AND(AC$30=$V$52,AC50=\"\",AC51=\"\",SUM($Y$52:AB52)=0),1,\"\")","v":""},{"$f":"IF(AND(AD$30=$V$52,AD50=\"\",AD51=\"\",SUM($Y$52:AC52)=0),1,\"\")","v":""},{"$f":"IF(AND(AE$30=$V$52,AE50=\"\",AE51=\"\",SUM($Y$52:AD52)=0),1,\"\")","v":""},{"$f":"IF(AND(AF$30=$V$52,AF50=\"\",AF51=\"\",SUM($Y$52:AE52)=0),1,\"\")","v":""},{"$f":"IF(AND(AG$30=$V$52,AG50=\"\",AG51=\"\",SUM($Y$52:AF52)=0),1,\"\")","v":""},{"$f":"IF(AND(AH$30=$V$52,AH50=\"\",AH51=\"\",SUM($Y$52:AG52)=0),1,\"\")","v":""},{"$f":"IF(AND(AI$30=$V$52,AI50=\"\",AI51=\"\",SUM($Y$52:AH52)=0),1,\"\")","v":""},{"$f":"IF(AND(AJ$30=$V$52,AJ50=\"\",AJ51=\"\",SUM($Y$52:AI52)=0),1,\"\")","v":""},{"$f":"IF(AND(AK$30=$V$52,AK50=\"\",AK51=\"\",SUM($Y$52:AJ52)=0),1,\"\")","v":""},null,null,null,null,null,null,null,null,null,null,null,null,null,null,null,null,null,null,48]
[null,null,null,null,null,null,null,null,null,null,null,null,null,null,null,null,null,null,null,null,null,null,null,null,null,null,null,null,null,null,null,null,null,null,null,null,null,null,null,null,null,null,null,null,null,null,null,null,null,null,null,null,null,null,null,49]
[null,null,null,null,null,null,null,null,null,null,null,null,null,null,null,null,null,null,null,null,null,null,null,null,null,null,null,null,null,null,null,null,null,null,null,null,null,null,null,null,null,null,null,null,null,null,null,null,null,null,null,null,null,null,null,50]
[null,null,null,null,null,null,null,null,null,null,null,null,null,null,null,null,{"$f":"IF(R55=\"\",\"\",VLOOKUP(R55,Planning_général!$E$17:$F$62,2,0))","v":""},{"$f":"IF(W55=1,$W$3,IF(X55=1,$X$3,IF(Y55=1,$Y$3,IF(Z55=1,$Z$3,IF(AA55=1,$AA$3,IF(AB55=1,$AB$3,IF(AC55=1,$AC$3,IF(AD55=1,$AD$3,IF(AE55=1,$AE$3,IF(AF55=1,$AF$3,IF(AG55=1,$AG$3,IF(AH55=1,$AH$3,IF(AI55=1,$AI$3,IF(AJ55=1,$AJ$3,IF(AK55=1,$AK$3,\"\")))))))))))))))","v":""},{"$f":"IF(U55=1,U$9,IF(V55=1,V$9,IF(W55=1,W$9,IF(X55=1,X$9,IF(Y55=1,Y$9,IF(Z55=1,Z$9,IF(AA55=1,AA$9,IF(AB55=1,AB$9,IF(AC55=1,AC$9,IF(AD55=1,AD$9,IF(AE55=1,AE$9,\"\")))))))))))","v":""},"Après-midi",null,"J4",{"$f":"IF($V$55=$W$30,1,\"\")","v":""},{"$f":"IF(AND($V$55=$X$30,W55=\"\"),1,\"\")","v":""},{"$f":"IF(AND($V$55=$Y$30,X55=\"\",W55=\"\"),1,\"\")","v":""},{"$f":"IF(AND($V$55=Z45,W55=\"\",X55=\"\",Y55=\"\"),1,\"\")","v":""},{"$f":"IF(AND($V$55=$AA$30,X55=\"\",Y55=\"\",Z55=\"\",W55=\"\"),1,\"\")","v":""},{"$f":"IF(AND($V$55=$AB$30,Y55=\"\",Z55=\"\",AA55=\"\",X55=\"\",W55=\"\"),1,\"\")","v":""},{"$f":"IF(AND($V$55=AC45,Z55=\"\",AA55=\"\",AB55=\"\",Y55=\"\",X55=\"\",W55=\"\"),1,\"\")","v":""},{"$f":"IF(AND($V$55=AD45,AA55=\"\",AB55=\"\",AC55=\"\",Z55=\"\",Y55=\"\",X55=\"\",W55=\"\"),1,\"\")","v":""},{"$f":"IF(AND($V$55=$AE$30,AB55=\"\",AC55=\"\",AD55=\"\",AA55=\"\",Z55=\"\",Y55=\"\",X55=\"\",W55=\"\"),1,\"\")","v":""},{"$f":"IF(AND($V$55=$AF$30,AC55=\"\",AD55=\"\",AE55=\"\",AB55=\"\",AA55=\"\",Z55=\"\",Y55=\"\",X55=\"\",W55=\"\"),1,\"\")","v":""},{"$f":"IF(AND($V$55=$AG$30,AD55=\"\",AE55=\"\",AF55=\"\",AC55=\"\",AB55=\"\",AA55=\"\",Z55=\"\",Y55=\"\",X55=\"\",W55=\"\"),1,\"\")","v":""},{"$f":"IF(AND($V$55=$AH$30,AE55=\"\",AF55=\"\",AG55=\"\",AD55=\"\",AC55=\"\",AB55=\"\",AA55=\"\",Z55=\"\",Y55=\"\",X55=\"\",W55=\"\"),1,\"\")","v":""},{"$f":"IF(AND($V$55=$AI$30,AF55=\"\",AG55=\"\",AH55=\"\",AE55=\"\",AD55=\"\",AC55=\"\",AB55=\"\",AA55=\"\",Z55=\"\",Y55=\"\",X55=\"\",W55=\"\"),1,\"\")","v":""},{"$f":"IF(AND($V$55=$AJ$30,AG55=\"\",AH55=\"\",AI55=\"\",AF55=\"\",AE55=\"\",AD55=\"\",AC55=\"\",AB55=\"\",AA55=\"\",Z55=\"\",Y55=\"\",X55=\"\",W55=\"\"),1,\"\")","v":""},{"$f":"IF(AND($V$55=$AK$30,AH55=\"\",AI55=\"\",AJ55=\"\",AG55=\"\",AF55=\"\",AE55=\"\",AD55=\"\",AC55=\"\",AB55=\"\",AA55=\"\",Z55=\"\",Y55=\"\",X55=\"\",W55=\"\"),1,\"\")","v":""},null,null,null,null,null,null,null,null,null,null,null,null,null,null,null,null,null,null,51]
[null,null,null,null,null,null,null,null,null,null,null,null,null,null,null,null,{"$f":"IF(R56=\"\",\"\",VLOOKUP(R56,Planning_général!$E$17:$F$62,2,0))","v":""},{"$f":"IF(W56=1,$W$3,IF(X56=1,$X$3,IF(Y56=1,$Y$3,IF(Z56=1,$Z$3,IF(AA56=1,$AA$3,IF(AB56=1,$AB$3,IF(AC56=1,$AC$3,IF(AD56=1,$AD$3,IF(AE56=1,$AE$3,IF(AF56=1,$AF$3,IF(AG56=1,$AG$3,IF(AH56=1,$AH$3,IF(AI56=1,$AI$3,IF(AJ56=1,$AJ$3,IF(AK56=1,$AK$3,\"\")))))))))))))))","v":""},{"$f":"IF(U56=1,U$9,IF(V56=1,V$9,IF(W56=1,W$9,IF(X56=1,X$9,IF(Y56=1,Y$9,IF(Z56=1,Z$9,IF(AA56=1,AA$9,IF(AB56=1,AB$9,IF(AC56=1,AC$9,IF(AD56=1,AD$9,IF(AE56=1,AE$9,\"\")))))))))))","v":""},null,null,"J4",null,{"$f":"IF(AND(X$30=$V$56,W56=\"\",X55=\"\"),1,\"\")","v":""},{"$f":"IF(AND(Y$30=$V$56,X56=\"\",Y55=\"\"),1,\"\")","v":""},{"$f":"IF(AND(Z$30=$V$56,Y56=\"\",Z55=\"\"),1,\"\")","v":""},{"$f":"IF(AND(AA$30=$V$56,AA55=\"\",SUM($X$56:Z56)=0),1,\"\")","v":""},{"$f":"IF(AND(AB$30=$V$56,AB55=\"\",SUM($X$56:AA56)=0),1,\"\")","v":""},{"$f":"IF(AND(AC$30=$V$56,AC55=\"\",SUM($X$56:AB56)=0),1,\"\")","v":""},{"$f":"IF(AND(AD$30=$V$56,AD55=\"\",SUM($X$56:AC56)=0),1,\"\")","v":""},{"$f":"IF(AND(AE$30=$V$56,AE55=\"\",SUM($X$56:AD56)=0),1,\"\")","v":""},{"$f":"IF(AND(AF$30=$V$56,AF55=\"\",SUM($X$56:AE56)=0),1,\"\")","v":""},{"$f":"IF(AND(AG$30=$V$56,AG55=\"\",SUM($X$56:AF56)=0),1,\"\")","v":""},{"$f":"IF(AND(AH$30=$V$56,AH55=\"\",SUM($X$56:AG56)=0),1,\"\")","v":""},{"$f":"IF(AND(AI$30=$V$56,AI55=\"\",SUM($X$56:AH56)=0),1,\"\")","v":""},{"$f":"IF(AND(AJ$30=$V$56,AJ55=\"\",SUM($X$56:AI56)=0),1,\"\")","v":""},{"$f":"IF(AND(AK$30=$V$56,AK55=\"\",SUM($X$56:AJ56)=0),1,\"\")","v":""},null,null,null,null,null,null,null,null,null,null,null,null,null,null,null,null,null,null,52]
[null,null,null,null,null,null,null,null,null,null,null,null,null,null,null,null,{"$f":"IF(R57=\"\",\"\",VLOOKUP(R57,Planning_général!$E$17:$F$62,2,0))","v":""},{"$f":"IF(W57=1,$W$3,IF(X57=1,$X$3,IF(Y57=1,$Y$3,IF(Z57=1,$Z$3,IF(AA57=1,$AA$3,IF(AB57=1,$AB$3,IF(AC57=1,$AC$3,IF(AD57=1,$AD$3,IF(AE57=1,$AE$3,IF(AF57=1,$AF$3,IF(AG57=1,$AG$3,IF(AH57=1,$AH$3,IF(AI57=1,$AI$3,IF(AJ57=1,$AJ$3,IF(AK57=1,$AK$3,\"\")))))))))))))))","v":""},{"$f":"IF(U57=1,U$9,IF(V57=1,V$9,IF(W57=1,W$9,IF(X57=1,X$9,IF(Y57=1,Y$9,IF(Z57=1,Z$9,IF(AA57=1,AA$9,IF(AB57=1,AB$9,IF(AC57=1,AC$9,IF(AD57=1,AD$9,IF(AE57=1,AE$9,\"\")))))))))))","v":""},null,null,"J4",null,null,{"$f":"IF(AND(Y$30=V57,X57=\"\",Y56=\"\",Y55=\"\"),1,\"\")","v":""},{"$f":"IF(AND(Z$30=V57,Y57=\"\",Z56=\"\",Z55=\"\"),1,\"\")","v":""},{"$f":"IF(AND(AA$30=$V$57,AA55=\"\",AA56=\"\",SUM($Y$52:Z57)=0),1,\"\")","v":""},{"$f":"IF(AND(AB$30=$V$57,AB55=\"\",AB56=\"\",SUM($Y$57:AA57)=0),1,\"\")","v":""},{"$f":"IF(AND(AC$30=$V$57,AC55=\"\",AC56=\"\",SUM($Y$57:AB57)=0),1,\"\")","v":""},{"$f":"IF(AND(AD$30=$V$57,AD55=\"\",AD56=\"\",SUM($Y$57:AC57)=0),1,\"\")","v":""},{"$f":"IF(AND(AE$30=$V$57,AE55=\"\",AE56=\"\",SUM($Y$57:AD57)=0),1,\"\")","v":""},{"$f":"IF(AND(AF$30=$V$57,AF55=\"\",AF56=\"\",SUM($Y$57:AE57)=0),1,\"\")","v":""},{"$f":"IF(AND(AG$30=$V$57,AG55=\"\",AG56=\"\",SUM($Y$57:AF57)=0),1,\"\")","v":""},{"$f":"IF(AND(AH$30=$V$57,AH55=\"\",AH56=\"\",SUM($Y$57:AG57)=0),1,\"\")","v":""},{"$f":"IF(AND(AI$30=$V$57,AI55=\"\",AI56=\"\",SUM($Y$57:AH57)=0),1,\"\")","v":""},{"$f":"IF(AND(AJ$30=$V$57,AJ55=\"\",AJ56=\"\",SUM($Y$57:AI57)=0),1,\"\")","v":""},{"$f":"IF(AND(AK$30=$V$57,AK55=\"\",AK56=\"\",SUM($Y$57:AJ57)=0),1,\"\")","v":""},null,null,null,null,null,null,null,null,null,null,null,null,null,null,null,null,null,null,53]
[]
[]
[null,null,null,null,null,null,null,null,null,null,null,null,null,null,null,null,{"$f":"IF(R60=\"\",\"\",VLOOKUP(R60,Planning_général!$E$17:$F$62,2,0))","v":""},{"$f":"IF(W60=1,$W$3,IF(X60=1,$X$3,IF(Y60=1,$Y$3,IF(Z60=1,$Z$3,IF(AA60=1,$AA$3,IF(AB60=1,$AB$3,IF(AC60=1,$AC$3,IF(AD60=1,$AD$3,IF(AE60=1,$AE$3,IF(AF60=1,$AF$3,IF(AG60=1,$AG$3,IF(AH60=1,$AH$3,IF(AI60=1,$AI$3,IF(AJ60=1,$AJ$3,IF(AK60=1,$AK$3,\"\")))))))))))))))","v":""},{"$f":"IF(U60=1,U$9,IF(V60=1,V$9,IF(W60=1,W$9,IF(X60=1,X$9,IF(Y60=1,Y$9,IF(Z60=1,Z$9,IF(AA60=1,AA$9,IF(AB60=1,AB$9,IF(AC60=1,AC$9,IF(AD60=1,AD$9,IF(AE60=1,AE$9,\"\")))))))))))","v":""},"Soir",null,"M3",{"$f":"IF($V$60=$W$30,1,\"\")","v":""},{"$f":"IF(AND($V$60=$X$30,W60=\"\"),1,\"\")","v":""},{"$f":"IF(AND($V$60=$Y$30,X60=\"\",W60=\"\"),1,\"\")","v":""},{"$f":"IF(AND($V$60=$Z$30,W60=\"\",X60=\"\",Y60=\"\"),1,\"\")","v":""},{"$f":"IF(AND($V$60=$AA$30,X60=\"\",Y60=\"\",Z60=\"\",W60=\"\"),1,\"\")","v":""},{"$f":"IF(AND($V$60=$AB$30,Y60=\"\",Z60=\"\",AA60=\"\",X60=\"\",W60=\"\"),1,\"\")","v":""},{"$f":"IF(AND($V$60=AC50,Z60=\"\",AA60=\"\",AB60=\"\",Y60=\"\",X60=\"\",W60=\"\"),1,\"\")","v":""},{"$f":"IF(AND($V$60=AD50,AA60=\"\",AB60=\"\",AC60=\"\",Z60=\"\",Y60=\"\",X60=\"\",W60=\"\"),1,\"\")","v":""},{"$f":"IF(AND($V$60=$AE$30,AB60=\"\",AC60=\"\",AD60=\"\",AA60=\"\",Z60=\"\",Y60=\"\",X60=\"\",W60=\"\"),1,\"\")","v":""},{"$f":"IF(AND($V$60=$AF$30,AC60=\"\",AD60=\"\",AE60=\"\",AB60=\"\",AA60=\"\",Z60=\"\",Y60=\"\",X60=\"\",W60=\"\"),1,\"\")","v":""},{"$f":"IF(AND($V$60=$AG$30,AD60=\"\",AE60=\"\",AF60=\"\",AC60=\"\",AB60=\"\",AA60=\"\",Z60=\"\",Y60=\"\",X60=\"\",W60=\"\"),1,\"\")","v":""},{"$f":"IF(AND($V$60=$AH$30,AE60=\"\",AF60=\"\",AG60=\"\",AD60=\"\",AC60=\"\",AB60=\"\",AA60=\"\",Z60=\"\",Y60=\"\",X60=\"\",W60=\"\"),1,\"\")","v":""},{"$f":"IF(AND($V$60=$AI$30,AF60=\"\",AG60=\"\",AH60=\"\",AE60=\"\",AD60=\"\",AC60=\"\",AB60=\"\",AA60=\"\",Z60=\"\",Y60=\"\",X60=\"\",W60=\"\"),1,\"\")","v":""},{"$f":"IF(AND($V$60=$AJ$30,AG60=\"\",AH60=\"\",AI60=\"\",AF60=\"\",AE60=\"\",AD60=\"\",AC60=\"\",AB60=\"\",AA60=\"\",Z60=\"\",Y60=\"\",X60=\"\",W60=\"\"),1,\"\")","v":""},{"$f":"IF(AND($V$60=$AK$30,AH60=\"\",AI60=\"\",AJ60=\"\",AG60=\"\",AF60=\"\",AE60=\"\",AD60=\"\",AC60=\"\",AB60=\"\",AA60=\"\",Z60=\"\",Y60=\"\",X60=\"\",W60=\"\"),1,\"\")","v":""}]
[null,null,null,null,null,null,null,null,null,null,null,null,null,null,null,null,{"$f":"IF(R61=\"\",\"\",VLOOKUP(R61,Planning_général!$E$17:$F$62,2,0))","v":""},{"$f":"IF(W61=1,$W$3,IF(X61=1,$X$3,IF(Y61=1,$Y$3,IF(Z61=1,$Z$3,IF(AA61=1,$AA$3,IF(AB61=1,$AB$3,IF(AC61=1,$AC$3,IF(AD61=1,$AD$3,IF(AE61=1,$AE$3,IF(AF61=1,$AF$3,IF(AG61=1,$AG$3,IF(AH61=1,$AH$3,IF(AI61=1,$AI$3,IF(AJ61=1,$AJ$3,IF(AK61=1,$AK$3,\"\")))))))))))))))","v":""},{"$f":"IF(U61=1,U$9,IF(V61=1,V$9,IF(W61=1,W$9,IF(X61=1,X$9,IF(Y61=1,Y$9,IF(Z61=1,Z$9,IF(AA61=1,AA$9,IF(AB61=1,AB$9,IF(AC61=1,AC$9,IF(AD61=1,AD$9,IF(AE61=1,AE$9,\"\")))))))))))","v":""},null,null,"M3",null,{"$f":"IF(AND(X$30=$V$61,W61=\"\",X60=\"\"),1,\"\")","v":""},{"$f":"IF(AND(Y$30=$V$61,X61=\"\",Y60=\"\"),1,\"\")","v":""},{"$f":"IF(AND(Z$30=$V$61,Y61=\"\",Z60=\"\"),1,\"\")","v":""},{"$f":"IF(AND(AA$30=$V$61,AA60=\"\",SUM($X$61:Z61)=0),1,\"\")","v":""},{"$f":"IF(AND(AB$30=$V$61,AB60=\"\",SUM($X$61:AA61)=0),1,\"\")","v":""},{"$f":"IF(AND(AC$30=$V$61,AC60=\"\",SUM($X$61:AB61)=0),1,\"\")","v":""},{"$f":"IF(AND(AD$30=$V$61,AD60=\"\",SUM($X$61:AC61)=0),1,\"\")","v":""},{"$f":"IF(AND(AE$30=$V$61,AE60=\"\",SUM($X$61:AD61)=0),1,\"\")","v":""},{"$f":"IF(AND(AF$30=$V$61,AF60=\"\",SUM($X$61:AE61)=0),1,\"\")","v":""},{"$f":"IF(AND(AG$30=$V$61,AG60=\"\",SUM($X$61:AF61)=0),1,\"\")","v":""},{"$f":"IF(AND(AH$30=$V$61,AH60=\"\",SUM($X$61:AG61)=0),1,\"\")","v":""},{"$f":"IF(AND(AI$30=$V$61,AI60=\"\",SUM($X$61:AH61)=0),1,\"\")","v":""},{"$f":"IF(AND(AJ$30=$V$61,AJ60=\"\",SUM($X$61:AI61)=0),1,\"\")","v":""},{"$f":"IF(AND(AK$30=$V$61,AK60=\"\",SUM($X$61:AJ61)=0),1,\"\")","v":""}]
[null,null,null,null,null,null,null,null,null,null,null,null,null,null,null,null,{"$f":"IF(R62=\"\",\"\",VLOOKUP(R62,Planning_général!$E$17:$F$62,2,0))","v":""},{"$f":"IF(W62=1,$W$3,IF(X62=1,$X$3,IF(Y62=1,$Y$3,IF(Z62=1,$Z$3,IF(AA62=1,$AA$3,IF(AB62=1,$AB$3,IF(AC62=1,$AC$3,IF(AD62=1,$AD$3,IF(AE62=1,$AE$3,IF(AF62=1,$AF$3,IF(AG62=1,$AG$3,IF(AH62=1,$AH$3,IF(AI62=1,$AI$3,IF(AJ62=1,$AJ$3,IF(AK62=1,$AK$3,\"\")))))))))))))))","v":""},{"$f":"IF(U62=1,U$9,IF(V62=1,V$9,IF(W62=1,W$9,IF(X62=1,X$9,IF(Y62=1,Y$9,IF(Z62=1,Z$9,IF(AA62=1,AA$9,IF(AB62=1,AB$9,IF(AC62=1,AC$9,IF(AD62=1,AD$9,IF(AE62=1,AE$9,\"\")))))))))))","v":""},null,null,"-",null,null,{"$f":"IF(AND(Y$30=V62,X62=\"\",Y61=\"\",Y60=\"\"),1,\"\")","v":""},{"$f":"IF(AND(Z$30=V62,Y62=\"\",Z61=\"\",Z60=\"\"),1,\"\")","v":""},{"$f":"IF(AND(AA$30=$V$62,AA60=\"\",AA61=\"\",SUM($Y$62:Z62)=0),1,\"\")","v":""},{"$f":"IF(AND(AB$30=$V$62,AB60=\"\",AB61=\"\",SUM($Y$62:AA62)=0),1,\"\")","v":""},{"$f":"IF(AND(AC$30=$V$62,AC60=\"\",AC61=\"\",SUM($Y$62:AB62)=0),1,\"\")","v":""},{"$f":"IF(AND(AD$30=$V$62,AD60=\"\",AD61=\"\",SUM($Y$62:AC62)=0),1,\"\")","v":""},{"$f":"IF(AND(AE$30=$V$62,AE60=\"\",AE61=\"\",SUM($Y$62:AD62)=0),1,\"\")","v":""},{"$f":"IF(AND(AF$30=$V$62,AF60=\"\",AF61=\"\",SUM($Y$62:AE62)=0),1,\"\")","v":""},{"$f":"IF(AND(AG$30=$V$62,AG60=\"\",AG61=\"\",SUM($Y$62:AF62)=0),1,\"\")","v":""},{"$f":"IF(AND(AH$30=$V$62,AH60=\"\",AH61=\"\",SUM($Y$62:AG62)=0),1,\"\")","v":""},{"$f":"IF(AND(AI$30=$V$62,AI60=\"\",AI61=\"\",SUM($Y$62:AH62)=0),1,\"\")","v":""},{"$f":"IF(AND(AJ$30=$V$62,AJ60=\"\",AJ61=\"\",SUM($Y$62:AI62)=0),1,\"\")","v":""},{"$f":"IF(AND(AK$30=$V$62,AK60=\"\",AK61=\"\",SUM($Y$62:AJ62)=0),1,\"\")","v":""}]
[]
[]
[null,null,null,null,null,null,null,null,null,null,null,null,null,null,null,null,null,{"$f":"IF(W65=1,$W$3,IF(X65=1,$X$3,IF(Y65=1,$Y$3,IF(Z65=1,$Z$3,IF(AA65=1,$AA$3,IF(AB65=1,$AB$3,IF(AC65=1,$AC$3,IF(AD65=1,$AD$3,IF(AE65=1,$AE$3,IF(AF65=1,$AF$3,IF(AG65=1,$AG$3,IF(AH65=1,$AH$3,IF(AI65=1,$AI$3,IF(AJ65=1,$AJ$3,IF(AK65=1,$AK$3,\"\")))))))))))))))","v":""},{"$f":"IF(U65=1,U$9,IF(V65=1,V$9,IF(W65=1,W$9,IF(X65=1,X$9,IF(Y65=1,Y$9,IF(Z65=1,Z$9,IF(AA65=1,AA$9,IF(AB65=1,AB$9,IF(AC65=1,AC$9,IF(AD65=1,AD$9,IF(AE65=1,AE$9,\"\")))))))))))","v":""},"Nuit",null,"-",{"$f":"IF($V$65=$W$30,1,\"\")","v":""},{"$f":"IF(AND($V$65=$X$30,W65=\"\"),1,\"\")","v":""},{"$f":"IF(AND($V$65=$Y$30,X65=\"\",W65=\"\"),1,\"\")","v":""},{"$f":"IF(AND($V$65=$Z$30,W65=\"\",X65=\"\",Y65=\"\"),1,\"\")","v":""},{"$f":"IF(AND($V$65=$AA$30,X65=\"\",Y65=\"\",Z65=\"\",W65=\"\"),1,\"\")","v":""},{"$f":"IF(AND($V$65=$AB$30,Y65=\"\",Z65=\"\",AA65=\"\",X65=\"\",W65=\"\"),1,\"\")","v":""},{"$f":"IF(AND($V$65=AC55,Z65=\"\",AA65=\"\",AB65=\"\",Y65=\"\",X65=\"\",W65=\"\"),1,\"\")","v":""},{"$f":"IF(AND($V$65=AD30,AA65=\"\",AB65=\"\",AC65=\"\",Z65=\"\",Y65=\"\",X65=\"\",W65=\"\"),1,\"\")","v":""},{"$f":"IF(AND($V$65=$AE$30,AB65=\"\",AC65=\"\",AD65=\"\",AA65=\"\",Z65=\"\",Y65=\"\",X65=\"\",W65=\"\"),1,\"\")","v":""},{"$f":"IF(AND($V$65=$AF$30,AC65=\"\",AD65=\"\",AE65=\"\",AB65=\"\",AA65=\"\",Z65=\"\",Y65=\"\",X65=\"\",W65=\"\"),1,\"\")","v":""},{"$f":"IF(AND($V$65=$AG$30,AD65=\"\",AE65=\"\",AF65=\"\",AC65=\"\",AB65=\"\",AA65=\"\",Z65=\"\",Y65=\"\",X65=\"\",W65=\"\"),1,\"\")","v":""},{"$f":"IF(AND($V$65=$AH$30,AE65=\"\",AF65=\"\",AG65=\"\",AD65=\"\",AC65=\"\",AB65=\"\",AA65=\"\",Z65=\"\",Y65=\"\",X65=\"\",W65=\"\"),1,\"\")","v":""},{"$f":"IF(AND($V$65=$AI$30,AF65=\"\",AG65=\"\",AH65=\"\",AE65=\"\",AD65=\"\",AC65=\"\",AB65=\"\",AA65=\"\",Z65=\"\",Y65=\"\",X65=\"\",W65=\"\"),1,\"\")","v":""},{"$f":"IF(AND($V$65=$AJ$30,AG65=\"\",AH65=\"\",AI65=\"\",AF65=\"\",AE65=\"\",AD65=\"\",AC65=\"\",AB65=\"\",AA65=\"\",Z65=\"\",Y65=\"\",X65=\"\",W65=\"\"),1,\"\")","v":""},{"$f":"IF(AND($V$65=$AK$30,AH65=\"\",AI65=\"\",AJ65=\"\",AG65=\"\",AF65=\"\",AE65=\"\",AD65=\"\",AC65=\"\",AB65=\"\",AA65=\"\",Z65=\"\",Y65=\"\",X65=\"\",W65=\"\"),1,\"\")","v":""}]
[null,null,null,null,null,null,null,null,null,null,null,null,null,null,null,null,null,{"$f":"IF(W66=1,$W$3,IF(X66=1,$X$3,IF(Y66=1,$Y$3,IF(Z66=1,$Z$3,IF(AA66=1,$AA$3,IF(AB66=1,$AB$3,IF(AC66=1,$AC$3,IF(AD66=1,$AD$3,IF(AE66=1,$AE$3,IF(AF66=1,$AF$3,IF(AG66=1,$AG$3,IF(AH66=1,$AH$3,IF(AI66=1,$AI$3,IF(AJ66=1,$AJ$3,IF(AK66=1,$AK$3,\"\")))))))))))))))","v":""},{"$f":"IF(U66=1,U$9,IF(V66=1,V$9,IF(W66=1,W$9,IF(X66=1,X$9,IF(Y66=1,Y$9,IF(Z66=1,Z$9,IF(AA66=1,AA$9,IF(AB66=1,AB$9,IF(AC66=1,AC$9,IF(AD66=1,AD$9,IF(AE66=1,AE$9,\"\")))))))))))","v":""},null,null,"-",null,{"$f":"IF(AND(X$30=$V$66,W66=\"\",X65=\"\"),1,\"\")","v":""},{"$f":"IF(AND(Y$30=$V$66,X66=\"\",Y65=\"\"),1,\"\")","v":""},{"$f":"IF(AND(Z$30=$V$66,Y66=\"\",Z65=\"\"),1,\"\")","v":""},{"$f":"IF(AND(AA$30=$V$66,AA65=\"\",SUM($X$66:Z66)=0),1,\"\")","v":""},{"$f":"IF(AND(AB$30=$V$66,AB65=\"\",SUM($X$66:AA66)=0),1,\"\")","v":""},{"$f":"IF(AND(AC$30=$V$66,AC65=\"\",SUM($X$66:AB66)=0),1,\"\")","v":""},{"$f":"IF(AND(AD$30=$V$66,AD65=\"\",SUM($X$66:AC66)=0),1,\"\")","v":""},{"$f":"IF(AND(AE$30=$V$66,AE65=\"\",SUM($X$66:AD66)=0),1,\"\")","v":""},{"$f":"IF(AND(AF$30=$V$66,AF65=\"\",SUM($X$66:AE66)=0),1,\"\")","v":""},{"$f":"IF(AND(AG$30=$V$66,AG65=\"\",SUM($X$66:AF66)=0),1,\"\")","v":""},{"$f":"IF(AND(AH$30=$V$66,AH65=\"\",SUM($X$66:AG66)=0),1,\"\")","v":""},{"$f":"IF(AND(AI$30=$V$66,AI65=\"\",SUM($X$66:AH66)=0),1,\"\")","v":""},{"$f":"IF(AND(AJ$30=$V$66,AJ65=\"\",SUM($X$66:AI66)=0),1,\"\")","v":""},{"$f":"IF(AND(AK$30=$V$66,AK65=\"\",SUM($X$66:AJ66)=0),1,\"\")","v":""}]
[null,null,null,null,null,null,null,null,null,null,null,null,null,null,null,null,null,{"$f":"IF(W67=1,$W$3,IF(X67=1,$X$3,IF(Y67=1,$Y$3,IF(Z67=1,$Z$3,IF(AA67=1,$AA$3,IF(AB67=1,$AB$3,IF(AC67=1,$AC$3,IF(AD67=1,$AD$3,IF(AE67=1,$AE$3,IF(AF67=1,$AF$3,IF(AG67=1,$AG$3,IF(AH67=1,$AH$3,IF(AI67=1,$AI$3,IF(AJ67=1,$AJ$3,IF(AK67=1,$AK$3,\"\")))))))))))))))","v":""},{"$f":"IF(U67=1,U$9,IF(V67=1,V$9,IF(W67=1,W$9,IF(X67=1,X$9,IF(Y67=1,Y$9,IF(Z67=1,Z$9,IF(AA67=1,AA$9,IF(AB67=1,AB$9,IF(AC67=1,AC$9,IF(AD67=1,AD$9,IF(AE67=1,AE$9,\"\")))))))))))","v":""},null,null,"-",null,null,{"$f":"IF(AND(Y$30=V67,X67=\"\",Y66=\"\",Y65=\"\"),1,\"\")","v":""},{"$f":"IF(AND(Z$30=V67,Y67=\"\",Z66=\"\",Z65=\"\"),1,\"\")","v":""},{"$f":"IF(AND(AA$30=$V$67,AA65=\"\",AA66=\"\",SUM($Y$67:Z67)=0),1,\"\")","v":""},{"$f":"IF(AND(AB$30=$V$67,AB65=\"\",AB66=\"\",SUM($Y$67:AA67)=0),1,\"\")","v":""},{"$f":"IF(AND(AC$30=$V$67,AC65=\"\",AC66=\"\",SUM($Y$67:AB67)=0),1,\"\")","v":""},{"$f":"IF(AND(AD$30=$V$67,AD65=\"\",AD66=\"\",SUM($Y$67:AC67)=0),1,\"\")","v":""},{"$f":"IF(AND(AE$30=$V$67,AE65=\"\",AE66=\"\",SUM($Y$67:AD67)=0),1,\"\")","v":""},{"$f":"IF(AND(AF$30=$V$67,AF65=\"\",AF66=\"\",SUM($Y$67:AE67)=0),1,\"\")","v":""},{"$f":"IF(AND(AG$30=$V$67,AG65=\"\",AG66=\"\",SUM($Y$67:AF67)=0),1,\"\")","v":""},{"$f":"IF(AND(AH$30=$V$67,AH65=\"\",AH66=\"\",SUM($Y$67:AG67)=0),1,\"\")","v":""},{"$f":"IF(AND(AI$30=$V$67,AI65=\"\",AI66=\"\",SUM($Y$67:AH67)=0),1,\"\")","v":""},{"$f":"IF(AND(AJ$30=$V$67,AJ65=\"\",AJ66=\"\",SUM($Y$67:AI67)=0),1,\"\")","v":""},{"$f":"IF(AND(AK$30=$V$67,AK65=\"\",AK66=\"\",SUM($Y$67:AJ67)=0),1,\"\")","v":""}]
[]
[]
[]
[null,null,null,null,null,null,null,null,null,null,null,null,null,null,{"$f":"V71","v":"Mardi"},{"$f":"LEN(Q71)","v":0},{"$f":"(CONCATENATE(IF(W71=1,CONCATENATE(\"-\",W$3,\"(\",W10,\")\"),\"\"),IF(X71=1,CONCATENATE(\"-\",X$3,\"(\",X10,\")\"),\"\"),IF(Y71=1,CONCATENATE(\"-\",Y$3,\"(\",Y10,\")\"),\"\"),IF(Z71=1,CONCATENATE(\"-\",Z$3,\"(\",Z10,\")\"),\"\"),IF(AA71=1,CONCATENATE(\"-\",AA$3,\"(\",AA10,\")\"),\"\"),IF(AB71=1,CONCATENATE(\"-\",AB$3,\"(\",AB10,\")\"),\"\"),IF(AC71=1,CONCATENATE(\"-\",AC$3,\"(\",AC10,\")\"),\"\"),IF(AD71=1,CONCATENATE(\"-\",AD$3,\"(\",AD10,\")\"),\"\"),IF(AE71=1,CONCATENATE(\"-\",AE$3,\"(\",AE10,\")\"),\"\"),IF(AF71=1,CONCATENATE(\"-\",AF$3,\"(\",AF10,\")\"),\"\"),IF(AG71=1,CONCATENATE(\"-\",AG$3,\"(\",AG10,\")\"),\"\"),IF(AH71=1,CONCATENATE(\"-\",AH$3,\"(\",AH10,\")\"),\"\"),IF(AI71=1,CONCATENATE(\"-\",AI$3,\"(\",AI10,\")\"),\"\"),IF(AJ71=1,CONCATENATE(\"-\",AJ$3,\"(\",AJ10,\")\"),\"\"),IF(AK71=1,CONCATENATE(\"-\",AK$3,\"(\",AK10,\")\"),\"\")))","v":""},null,null,null,null,{"$f":"V10","v":"Mardi"},{"$f":"IF((COUNTIF(W10,$AM$71)+COUNTIF(W10,$AM$72)+COUNTIF(W10,$AM$73)+COUNTIF(W10,$AM$74)+COUNTIF(W10,$AM$75)+COUNTIF(W10,$AM$76)+COUNTIF(W10,$AM$77)+COUNTIF(W10,$AM$78)+COUNTIF(W10,$AM$79)+COUNTIF(W10,$AM$80)+COUNTIF(W10,$AM$81))=0,\"\",COUNTIF(W10,$AM$71)+COUNTIF(W10,$AM$72)+COUNTIF(W10,$AM$73)+COUNTIF(W10,$AM$74)+COUNTIF(W10,$AM$75)+COUNTIF(W10,$AM$76)+COUNTIF(W10,$AM$77)+COUNTIF(W10,$AM$78)+COUNTIF(W10,$AM$79)+COUNTIF(W10,$AM$80)+COUNTIF(W10,$AM$81))","v":""},"","","","","","","","","","","","","","",null,"CP"]
[null,null,null,null,null,null,null,null,null,null,null,null,null,null,{"$f":"V72","v":"Mercredi"},{"$f":"LEN(Q72)","v":0},{"$f":"(CONCATENATE(IF(W72=1,CONCATENATE(\"-\",W$3,\"(\",W11,\")\"),\"\"),IF(X72=1,CONCATENATE(\"-\",X$3,\"(\",X11,\")\"),\"\"),IF(Y72=1,CONCATENATE(\"-\",Y$3,\"(\",Y11,\")\"),\"\"),IF(Z72=1,CONCATENATE(\"-\",Z$3,\"(\",Z11,\")\"),\"\"),IF(AA72=1,CONCATENATE(\"-\",AA$3,\"(\",AA11,\")\"),\"\"),IF(AB72=1,CONCATENATE(\"-\",AB$3,\"(\",AB11,\")\"),\"\"),IF(AC72=1,CONCATENATE(\"-\",AC$3,\"(\",AC11,\")\"),\"\"),IF(AD72=1,CONCATENATE(\"-\",AD$3,\"(\",AD11,\")\"),\"\"),IF(AE72=1,CONCATENATE(\"-\",AE$3,\"(\",AE11,\")\"),\"\"),IF(AF72=1,CONCATENATE(\"-\",AF$3,\"(\",AF11,\")\"),\"\"),IF(AG72=1,CONCATENATE(\"-\",AG$3,\"(\",AG11,\")\"),\"\"),IF(AH72=1,CONCATENATE(\"-\",AH$3,\"(\",AH11,\")\"),\"\"),IF(AI72=1,CONCATENATE(\"-\",AI$3,\"(\",AI11,\")\"),\"\"),IF(AJ72=1,CONCATENATE(\"-\",AJ$3,\"(\",AJ11,\")\"),\"\"),IF(AK72=1,CONCATENATE(\"-\",AK$3,\"(\",AK11,\")\"),\"\")))","v":""},null,null,null,null,{"$f":"V11","v":"Mercredi"},{"$f":"IF((COUNTIF(W11,$AM$71)+COUNTIF(W11,$AM$72)+COUNTIF(W11,$AM$73)+COUNTIF(W11,$AM$74)+COUNTIF(W11,$AM$75)+COUNTIF(W11,$AM$76)+COUNTIF(W11,$AM$77)+COUNTIF(W11,$AM$78)+COUNTIF(W11,$AM$79)+COUNTIF(W11,$AM$80)+COUNTIF(W11,$AM$81))=0,\"\",COUNTIF(W11,$AM$71)+COUNTIF(W11,$AM$72)+COUNTIF(W11,$AM$73)+COUNTIF(W11,$AM$74)+COUNTIF(W11,$AM$75)+COUNTIF(W11,$AM$76)+COUNTIF(W11,$AM$77)+COUNTIF(W11,$AM$78)+COUNTIF(W11,$AM$79)+COUNTIF(W11,$AM$80)+COUNTIF(W11,$AM$81))","v":""},"","","","","","","","","","","","","","",null,"Recup"]
[null,null,null,null,null,null,null,null,null,null,null,null,null,null,"Jeudi",0,{"$f":"(CONCATENATE(IF(W73=1,CONCATENATE(\"-\",W$3,\"(\",W12,\")\"),\"\"),IF(X73=1,CONCATENATE(\"-\",X$3,\"(\",X12,\")\"),\"\"),IF(Y73=1,CONCATENATE(\"-\",Y$3,\"(\",Y12,\")\"),\"\"),IF(Z73=1,CONCATENATE(\"-\",Z$3,\"(\",Z12,\")\"),\"\"),IF(AA73=1,CONCATENATE(\"-\",AA$3,\"(\",AA12,\")\"),\"\"),IF(AB73=1,CONCATENATE(\"-\",AB$3,\"(\",AB12,\")\"),\"\"),IF(AC73=1,CONCATENATE(\"-\",AC$3,\"(\",AC12,\")\"),\"\"),IF(AD73=1,CONCATENATE(\"-\",AD$3,\"(\",AD12,\")\"),\"\"),IF(AE73=1,CONCATENATE(\"-\",AE$3,\"(\",AE12,\")\"),\"\"),IF(AF73=1,CONCATENATE(\"-\",AF$3,\"(\",AF12,\")\"),\"\"),IF(AG73=1,CONCATENATE(\"-\",AG$3,\"(\",AG12,\")\"),\"\"),IF(AH73=1,CONCATENATE(\"-\",AH$3,\"(\",AH12,\")\"),\"\"),IF(AI73=1,CONCATENATE(\"-\",AI$3,\"(\",AI12,\")\"),\"\"),IF(AJ73=1,CONCATENATE(\"-\",AJ$3,\"(\",AJ12,\")\"),\"\"),IF(AK73=1,CONCATENATE(\"-\",AK$3,\"(\",AK12,\")\"),\"\")))","v":""},null,null,null,null,{"$f":"V12","v":"Jeudi"},{"$f":"IF((COUNTIF(W12,$AM$71)+COUNTIF(W12,$AM$72)+COUNTIF(W12,$AM$73)+COUNTIF(W12,$AM$74)+COUNTIF(W12,$AM$75)+COUNTIF(W12,$AM$76)+COUNTIF(W12,$AM$77)+COUNTIF(W12,$AM$78)+COUNTIF(W12,$AM$79)+COUNTIF(W12,$AM$80)+COUNTIF(W12,$AM$81))=0,\"\",COUNTIF(W12,$AM$71)+COUNTIF(W12,$AM$72)+COUNTIF(W12,$AM$73)+COUNTIF(W12,$AM$74)+COUNTIF(W12,$AM$75)+COUNTIF(W12,$AM$76)+COUNTIF(W12,$AM$77)+COUNTIF(W12,$AM$78)+COUNTIF(W12,$AM$79)+COUNTIF(W12,$AM$80)+COUNTIF(W12,$AM$81))","v":""},"","","","","","","","","","","","","","",null,"Form"]
[null,null,null,null,null,null,null,null,null,null,null,null,null,null,"Vendredi",0,{"$f":"(CONCATENATE(IF(W74=1,CONCATENATE(\"-\",W$3,\"(\",W13,\")\"),\"\"),IF(X74=1,CONCATENATE(\"-\",X$3,\"(\",X13,\")\"),\"\"),IF(Y74=1,CONCATENATE(\"-\",Y$3,\"(\",Y13,\")\"),\"\"),IF(Z74=1,CONCATENATE(\"-\",Z$3,\"(\",Z13,\")\"),\"\"),IF(AA74=1,CONCATENATE(\"-\",AA$3,\"(\",AA13,\")\"),\"\"),IF(AB74=1,CONCATENATE(\"-\",AB$3,\"(\",AB13,\")\"),\"\"),IF(AC74=1,CONCATENATE(\"-\",AC$3,\"(\",AC13,\")\"),\"\"),IF(AD74=1,CONCATENATE(\"-\",AD$3,\"(\",AD13,\")\"),\"\"),IF(AE74=1,CONCATENATE(\"-\",AE$3,\"(\",AE13,\")\"),\"\"),IF(AF74=1,CONCATENATE(\"-\",AF$3,\"(\",AF13,\")\"),\"\"),IF(AG74=1,CONCATENATE(\"-\",AG$3,\"(\",AG13,\")\"),\"\"),IF(AH74=1,CONCATENATE(\"-\",AH$3,\"(\",AH13,\")\"),\"\"),IF(AI74=1,CONCATENATE(\"-\",AI$3,\"(\",AI13,\")\"),\"\"),IF(AJ74=1,CONCATENATE(\"-\",AJ$3,\"(\",AJ13,\")\"),\"\"),IF(AK74=1,CONCATENATE(\"-\",AK$3,\"(\",AK13,\")\"),\"\")))","v":""},null,null,null,null,{"$f":"V13","v":"Vendredi"},{"$f":"IF((COUNTIF(W13,$AM$71)+COUNTIF(W13,$AM$72)+COUNTIF(W13,$AM$73)+COUNTIF(W13,$AM$74)+COUNTIF(W13,$AM$75)+COUNTIF(W13,$AM$76)+COUNTIF(W13,$AM$77)+COUNTIF(W13,$AM$78)+COUNTIF(W13,$AM$79)+COUNTIF(W13,$AM$80)+COUNTIF(W13,$AM$81))=0,\"\",COUNTIF(W13,$AM$71)+COUNTIF(W13,$AM$72)+COUNTIF(W13,$AM$73)+COUNTIF(W13,$AM$74)+COUNTIF(W13,$AM$75)+COUNTIF(W13,$AM$76)+COUNTIF(W13,$AM$77)+COUNTIF(W13,$AM$78)+COUNTIF(W13,$AM$79)+COUNTIF(W13,$AM$80)+COUNTIF(W13,$AM$81))","v":""},"","","","","","","","","","","","","","",null,"Modul"]
[null,null,null,null,null,null,null,null,null,null,null,null,null,null,"Samedi",0,"",null,null,null,null,"Samedi",{"$f":"IF((COUNTIF(W14,$AM$71)+COUNTIF(W14,$AM$72)+COUNTIF(W14,$AM$73)+COUNTIF(W14,$AM$74)+COUNTIF(W14,$AM$75)+COUNTIF(W14,$AM$76)+COUNTIF(W14,$AM$77)+COUNTIF(W14,$AM$78)+COUNTIF(W14,$AM$79)+COUNTIF(W14,$AM$80)+COUNTIF(W14,$AM$81))=0,\"\",COUNTIF(W14,$AM$71)+COUNTIF(W14,$AM$72)+COUNTIF(W14,$AM$73)+COUNTIF(W14,$AM$74)+COUNTIF(W14,$AM$75)+COUNTIF(W14,$AM$76)+COUNTIF(W14,$AM$77)+COUNTIF(W14,$AM$78)+COUNTIF(W14,$AM$79)+COUNTIF(W14,$AM$80)+COUNTIF(W14,$AM$81))","v":""},"","","","","","","","","","","","","","",null,"H.R"]
[null,null,null,null,null,null,null,null,null,null,null,null,null,null,"Dimanche",0,"",null,null,null,null,"Dimanche",{"$f":"IF((COUNTIF(W15,$AM$71)+COUNTIF(W15,$AM$72)+COUNTIF(W15,$AM$73)+COUNTIF(W15,$AM$74)+COUNTIF(W15,$AM$75)+COUNTIF(W15,$AM$76)+COUNTIF(W15,$AM$77)+COUNTIF(W15,$AM$78)+COUNTIF(W15,$AM$79)+COUNTIF(W15,$AM$80)+COUNTIF(W15,$AM$81))=0,\"\",COUNTIF(W15,$AM$71)+COUNTIF(W15,$AM$72)+COUNTIF(W15,$AM$73)+COUNTIF(W15,$AM$74)+COUNTIF(W15,$AM$75)+COUNTIF(W15,$AM$76)+COUNTIF(W15,$AM$77)+COUNTIF(W15,$AM$78)+COUNTIF(W15,$AM$79)+COUNTIF(W15,$AM$80)+COUNTIF(W15,$AM$81))","v":""},"","","","","","","","","","","","","","",null,"HR Nuit"]
[null,null,null,null,null,null,null,null,null,null,null,null,null,null,"Lundi",0,"",null,null,null,null,"Lundi",{"$f":"IF((COUNTIF(W16,$AM$71)+COUNTIF(W16,$AM$72)+COUNTIF(W16,$AM$73)+COUNTIF(W16,$AM$74)+COUNTIF(W16,$AM$75)+COUNTIF(W16,$AM$76)+COUNTIF(W16,$AM$77)+COUNTIF(W16,$AM$78)+COUNTIF(W16,$AM$79)+COUNTIF(W16,$AM$80)+COUNTIF(W16,$AM$81))=0,\"\",COUNTIF(W16,$AM$71)+COUNTIF(W16,$AM$72)+COUNTIF(W16,$AM$73)+COUNTIF(W16,$AM$74)+COUNTIF(W16,$AM$75)+COUNTIF(W16,$AM$76)+COUNTIF(W16,$AM$77)+COUNTIF(W16,$AM$78)+COUNTIF(W16,$AM$79)+COUNTIF(W16,$AM$80)+COUNTIF(W16,$AM$81))","v":""},"","","","","","","","","","","","","","",null,"RTT"]
[null,null,null,null,null,null,null,null,null,null,null,null,null,null,null,null,null,null,null,null,null,null,{"$f":"IF((COUNTIF(W10,$AM$71)+COUNTIF(W10,$AM$72)+COUNTIF(W10,$AM$73)+COUNTIF(W10,$AM$74)+COUNTIF(W10,$AM$75)+COUNTIF(W10,$AM$75)+COUNTIF(W10,$AM$76)+COUNTIF(W10,$AM$77)+COUNTIF(W10,$AM$78))=0,\"\",COUNTIF(W10,$AM$71)+COUNTIF(W10,$AM$72)+COUNTIF(W10,$AM$73)+COUNTIF(W10,$AM$74)+COUNTIF(W10,$AM$75)+COUNTIF(W10,$AM$75)+COUNTIF(W10,$AM$76)+COUNTIF(W10,$AM$77)+COUNTIF(W10,$AM$78))","v":""},"","","","","","","","","","","","","","",null,"Malade"]
[null,null,null,null,null,null,null,null,null,null,null,null,null,null,null,null,null,null,null,null,null,null,null,null,null,null,null,null,null,null,null,null,null,null,null,null,null,null,"Mal"]
[null,null,null,null,null,null,null,null,null,null,null,null,null,null,null,null,null,null,null,null,null,null,null,null,null,null,null,null,null,null,null,null,null,null,null,null,null,null,"J.A"]
[null,null,null,null,null,null,null,null,null,null,null,null,null,null,null,null,null,null,null,null,null,null,null,null,null,null,null,null,null,null,null,null,null,null,null,null,null,null,"Ecole"]